{"text_format":"2","workbook":"xlsx","n_sheets":8,"sheets":["START","Energy Demand","Available Area","Solar Energy Yield","Plant Cost","Economic Feasibility","Environmental Impact","Data"],"not_rendered":{"charts":1,"images":3,"macros":0,"external_links":0,"defined_names":1,"comments":0,"pivot_tables":0},"unopened":[],"bounds":{"document_bytes":16777216,"sheet_cells":100000,"run_cost":"one","rows_first":2000,"rows_last":500,"rows_between":2000,"halvings":0,"cell_chars":16384,"cell_head_chars":4096},"cells_cut":0,"cells_raw":0,"read":"whole","date_system":"1900"}

{"sheet":"START","index":0,"n_rows":15,"n_cols":2,"rows_kept":15,"cut":false,"hidden":false,"merged":[[0,0,0,16383]]}
["Solar Heat for Industrial Processes - Feasibility Calculator for Mexico"]
[]
[]
[null,"This tool has been created in the course of the project TrustCS."]
[]
[null,"This is a beta-version under development, no liability is assumed."]
[]
[null,"Information for usage:"]
[null,"Only cells surrounded by a black box can be edited!"]
[null,"For each integration point at a company, a seperate document has to be filled"]
[]
[null,"Company name"]
[null,"Integration point"]
[null,"Date"]
[null,"Comments"]

{"sheet":"Energy Demand","index":1,"n_rows":18,"n_cols":6,"rows_kept":18,"cut":false,"hidden":false,"merged":[[0,0,0,16383],[2,0,2,9]]}
["Effective Energy Demand"]
[]
["In industrial companies, solar thermal collectors can be integrated at supply or process level.\nFor each integration point a new excel sheet needs to be filled."]
["Parameter","Unit","Value"]
["Annual heat demand","MWh",3000]
["Annual Schedule - Annual operation days",null,365]
["Daily Schedule",null,"Continuous (0 am - 12 pm)"]
["Weekly Schedule",null,"5 Days/Week (MON-FRI)"]
["Daily operation hours",null,{"$f":"IF(C7=\"Daytime (8 am - 8 pm)\",12,IF(C7=\"Nighttime (8 pm - 8 am)\",12,24))","v":24}]
["Type of boiler or process",null,"Hot Water"]
[]
["Steam/Hot Water temperature (boiler outlet)","°C",50]
["Feed water temperature (boiler inlet)","°C",{"$f":"C12-30","v":20}]
["Pressure level","bar",3]
["Saturation temperature","°C",{"$f":"VLOOKUP(C14,Data!L3:M62,2)","v":133.5},"→",{"$f":"IF(C10=\"Hot Water\",IF(C15<C12,\"Consistency check failed!\",\"Consistency check okay!\"),IF(C15>C12,\"Consistency check failed!\",\"Consistency check okay!\"))","v":"Consistency check okay!"},{"$f":"IF(C10=\"Hot Water\",IF(C15<C12,\"Outlet temperature is above saturation temperature. Please adapt inputs!\",\"\"),IF(C15>C12,\"Outlet temperature is below saturation temperature. Please adapt inputs!\",\"\"))","v":""}]
["Heat transfer fluid used in solar system",null,{"$f":"IF(C10=\"Hot Water\",\"Water\",\"Thermal Oil\")","v":"Water"}]
["Heat capacity","kJ/kgK",{"$f":"IF(C16=\"Water\",4.19,2)","v":4.1900000000000004}]
["Mean thermal load","kW",{"$f":"C5*1000/C6/C9*IF(C8=\"5 Days/Week (MON-FRI)\",7/5,1)","v":479.45205479452051}]

{"sheet":"Available Area","index":2,"n_rows":5,"n_cols":3,"rows_kept":5,"cut":false,"hidden":false,"merged":[[0,0,0,16383],[2,0,2,5]]}
["Available Area"]
[]
["In this table, the available free space for the installation of solar thermal collectors is given. "]
["Parameter","Unit","Value"]
["Available free space","m²",4000]

{"sheet":"Solar Energy Yield","index":3,"n_rows":24,"n_cols":6,"rows_kept":24,"cut":false,"hidden":false,"merged":[[0,0,0,16383]]}
["Solar Energy Yield"]
[]
[]
["Parameter","Unit","Value"]
["Annual Direct Normal Irradiation (DNI) at project site","kWh/m²a",2575,null,"from https://globalsolaratlas.info"]
["Annual Global Horizontal Irradiation (GHI) at project site","kWh/m²a",2250,null,"from https://globalsolaratlas.info"]
[]
["Collector technology",null,"Flat Plate",null,"Suggested technology:",{"$f":"IF('Energy Demand'!C12<100,\"Evacuated Tube or Flat Plate\",IF('Energy Demand'!C12<150,\"Evacuated Tube, Parabolic trough or Linear Fresnel\",IF('Energy Demand'!C12>=150,\"Parabolic trough or Linear Fresnel\")))","v":"Evacuated Tube or Flat Plate"}]
["Technology type",null,{"$f":"IF(OR(C8=\"Evacuated Tube\",C8=\"Flat Plate\"),\"Stationary\",\"Tracking\")","v":"Stationary"},"→",{"$f":"IF(AND(C8=\"Flat Plate\",'Energy Demand'!C12>90),\"Consistency check failed!\",IF(AND(C8=\"Evacuated Tube\",'Energy Demand'!C12>140),\"Consistency check failed!\",IF(AND(OR(C8=\"Parabolic Trough\",C8=\"Linear Fresnel\"),OR('Energy Demand'!C12<120,'Energy Demand'!C12>250)),\"Consistency check failed!\",\"Consistency check okay!\")))","v":"Consistency check okay!"},{"$f":"IF(E9=\"Consistency check failed!\",\"This collector type is not suitable for the given temperature level!\",\"\")","v":""}]
[]
["Targeted solar fraction","%",30]
[]
["Storage size",null,"large"]
["Specific storage capacity","Wh/m²",{"$f":"IF(C13=\"very small\",300,IF(C13=\"small\",700,IF(C13=\"medium\",1100,1500)))","v":1500},null,"Storage capacity per m² solar field area"]
["Specific storage volume","l/m²",{"$f":"C14/('Energy Demand'!C17*('Energy Demand'!C12-'Energy Demand'!C13)*1000)*3600","v":42.959427207637226},null,"Storage volume per m² solar field area"]
[]
["System efficiency at location","%",{"$f":"VLOOKUP(IF(C8=\"Parabolic Trough\",\"PTC\",IF(C8=\"Linear Fresnel\",\"LFC\",IF(C8=\"Flat Plate\",\"FPC\",\"ETC\")))&'Energy Demand'!C12&IF('Energy Demand'!C7=\"Daytime (8 am - 8 pm)\",\"day\",\"continuous\")&IF('Energy Demand'!C8=\"5 Days/Week (MON-FRI)\",\"5days\",\"7days\")&C14&TEXT(C11/100,\"0.0\"),Data!A2:J1024,IF(C9=\"Tracking\",9,10),0)*100","v":42.324313965400002},null,"Based on simulation results for Mexico",{"$f":"IF(C8=\"Parabolic Trough\",\"PTC\",IF(C8=\"Linear Fresnel\",\"LFC\",IF(C8=\"Flat Plate\",\"FPC\",\"ETC\")))&'Energy Demand'!C12&IF('Energy Demand'!C7=\"Daytime (8 am - 8 pm)\",\"day\",\"continuous\")&IF('Energy Demand'!C8=\"5 Days/Week (MON-FRI)\",\"5days\",\"7days\")&C14&TEXT(C11/100,\"0.0\")","v":"FPC50continuous5days15000.3"}]
[]
["Solar field aperture area","m²",{"$f":"ROUNDUP(C11/100*'Energy Demand'!C5*1000/(C17/100*C5),0)","v":826}]
["Storage capacity","kWh",{"$f":"C19*C14/1000","v":1239}]
["Storage volume","m³",{"$f":"C15*C19/1000","v":35.484486873508352}]
[]
["Needed space for collector installation","m²",{"$f":"C19*IF(C8=\"Parabolic Trough\",2.5,IF(C8=\"Linear Fresnel\",1.6,1.8))","v":1486.8},"→",{"$f":"IF(C23>'Available Area'!C5,\"Consistency check failed!\",\"Consistency check okay!\")","v":"Consistency check okay!"},{"$f":"IF(C23>'Available Area'!C5,\"The available free space may not be sufficient for this solar thermal installation!\",\"The available free space is probably sufficient for this solar thermal installation\")","v":"The available free space is probably sufficient for this solar thermal installation"}]
["Annual solar energy yield","MWh",{"$f":"C11/100*'Energy Demand'!C5","v":900}]

{"sheet":"Plant Cost","index":4,"n_rows":11,"n_cols":7,"rows_kept":11,"cut":false,"hidden":false,"merged":[[0,0,0,16383]]}
["Plant Cost"]
[]
[]
["Parameter","Unit","Value"]
["Specific collector costs","US$/m²",350]
["Specific storage costs","US$/m³",1800]
["Absolute collector costs","US$",{"$f":"C5*'Solar Energy Yield'!C19","v":289100}]
["Absolute storage costs","US$",{"$f":"C6*'Solar Energy Yield'!C21","v":63872.076372315038}]
["Other costs","US$",0]
["Total capital expenditures (CAPEX)","US$",{"$f":"SUM(C7:C9)","v":352972.07637231506}]
["Operational expenditures (OPEX)","US$/a",7000,null,"Suggested:",{"$f":"0.02*C10","v":7059.4415274463017},"(~2% of CAPEX)"]

{"sheet":"Economic Feasibility","index":5,"n_rows":57,"n_cols":6,"rows_kept":57,"cut":false,"hidden":false,"merged":[[0,0,0,16383]]}
["Economic Feasibility"]
[]
[]
["Parameter","Unit","Value"]
["Annual yield","MWh",{"$f":"'Solar Energy Yield'!C24","v":900},null,"Extracted from tab \"Solar Energy Yield\""]
["CAPEX","US$",{"$f":"'Plant Cost'!C10","v":352972.07637231506},null,"Extracted from tab \"Cost Data\""]
["Operational expenditures","US$/a",{"$f":"'Plant Cost'!C11","v":7000},null,"Extracted from tab \"Cost Data\""]
["Conventional/comparative energy costs","US$/MWh",60]
["Project lifetime","a",20]
["Weighted Average Cost of Capital (WACC)","%/a",{"$f":"C24%*C25+(1-C24%)*C27","v":13.5},null,"calculated from debt ratio, cost of debt and equity: requires inputs of debt and equity rate"]
["Inflation rate ","%/a",3]
["Effective rate (of cost of capital, COC)","%/a",14,"→",{"$f":"IF(C12>C10,\"Consistency check okay!\",\"Consistency check failed!\")","v":"Consistency check okay!"},{"$f":"IF(C12>C10,\"WACC below COC.\",\"WACC above COC.\")","v":"WACC below COC."}]
["Discount rate adjusted for inflation","%/a",{"$f":"(((1+C12/100)/(1+C11/100))-1)*100","v":10.679611650485455}]
["Free cash from saved costs","US$/a",{"$f":"C8*C5-C7","v":47000}]
["Annuity factor"," -",{"$f":"1/PMT(C13%,C9,-1)","v":8.1331069281429738},null,"Sum of annual discount factors"]
["Project value based on effective rate","US$/a",{"$f":"C15*C14","v":382256.02562271978}]
["Project or investment margin","US$",{"$f":"C16-C6","v":29283.949250404723},"→",{"$f":"IF(C17>0,\"The project is economically viable.\",\"The project is not economically viable.\")","v":"The project is economically viable."}]
["Discounted payback period for CAPEX incl. COC","years",{"$f":"+(LN(C14)-LN(C14-C6*C13%))/LN(1+C13%)","v":15.962519506083011}]
["Simple payback period for CAPEX excl. COC","years",{"$f":"(LN(C14)-LN(C14-C6*(1/(1+C11%)-1)))/LN(1/(1+C11%))","v":6.69231587200556}]
["LCOH (average cost constant over lifetime)","US$/MWh",{"$f":"(C6*PMT(C12%,C9,-1)+C7)/C5","v":66.993158316147245}]
["LCOH (initial cost inflating over lifetime)","US$/MWh",{"$f":"(C6*PMT(C13%,C9,-1)+C7)/C5","v":55.999349119984103}]
[]
["Optional consistency checks"]
["Offtaker's debt ratio =debt/(debt+equity)","%",50]
["Offtaker's required rate on equity","%",16]
["Bank's offer of debt tenor","years",9]
["Bank's offer of client interest rate","%",11]
["Bank's offer of debt service coverage ratio","%",150]
["Debt volume based on Bank's market offer","US$",{"$f":"C14/C28%/PMT((1+C27%)/(1+C11%)-1,C26,-1)","v":197646.67032359683},null,"both debt volumes should compare in order of magnitude"]
["Debt volume based on offtaker's debt ratio","US$",{"$f":"C16*C24%","v":191128.01281135989},null,"both debt volumes should compare in order of magnitude"]
["Debt volume as average of 2 options above","US$",{"$f":"AVERAGE(C29:C30)","v":194387.34156747838}]
["Residual equity vol. to match Project Value","US$",{"$f":"C16-C31","v":187868.68405524141},null,"both equity volumes should compare in order of magnitude"]
["Possible equity vol. based on Offtaker's equity rate","US$",{"$f":"C14/PMT((1+C25%)/(1+C11%)-1,C9,-1) -C14/C28%/PMT((1+C25%)/(1+C11%)-1,C26,-1)","v":174743.27383724842},null,"both equity volumes should compare in order of magnitude"]
["Minimum equity vol. to cover CAPEX (informative)","US$",{"$f":"C6-C31","v":158584.73480483668}]
[]
["Cashflows of initial financing less CAPEX equal margin\nvs operational saved Costs spent on cost of capital (COC)","Financing vs COC","CAPEX vs Saved Energy Costs","Investment Margin"]
["Commercial Operation Date (COD)",{"$f":"NPV(C12%,C38:C57)","v":382256.02562272002},{"$f":"-C6","v":-352972.07637231506},{"$f":"-C37-B37","v":-29283.949250404956}]
["Operational Year 01",{"$f":"-C38","v":-48410},{"$f":"C$14*(1+C$11%)^COUNT(C$37:C37)*(C$9>=COUNT(C$37:C37))","v":48410},0]
["Operational Year 02",{"$f":"-C39","v":-49862.299999999996},{"$f":"C$14*(1+C$11%)^COUNT(C$37:C38)*(C$9>=COUNT(C$37:C38))","v":49862.299999999996},0]
["Operational Year 03",-51358.169000000002,{"$f":"C$14*(1+C$11%)^COUNT(C$37:C39)*(C$9>=COUNT(C$37:C39))","v":51358.169000000002},0]
["Operational Year 04",-52898.914069999999,{"$f":"C$14*(1+C$11%)^COUNT(C$37:C40)*(C$9>=COUNT(C$37:C40))","v":52898.914069999999},0]
["Operational Year 05",-54485.881492099994,{"$f":"C$14*(1+C$11%)^COUNT(C$37:C41)*(C$9>=COUNT(C$37:C41))","v":54485.881492099994},0]
["Operational Year 06",-56120.457936862993,{"$f":"C$14*(1+C$11%)^COUNT(C$37:C42)*(C$9>=COUNT(C$37:C42))","v":56120.457936862993},0]
["Operational Year 07",-57804.071674968887,{"$f":"C$14*(1+C$11%)^COUNT(C$37:C43)*(C$9>=COUNT(C$37:C43))","v":57804.071674968887},0]
["Operational Year 08",-59538.193825217946,{"$f":"C$14*(1+C$11%)^COUNT(C$37:C44)*(C$9>=COUNT(C$37:C44))","v":59538.193825217946},0]
["Operational Year 09",-61324.339639974489,{"$f":"C$14*(1+C$11%)^COUNT(C$37:C45)*(C$9>=COUNT(C$37:C45))","v":61324.339639974489},0]
["Operational Year 10",-63164.069829173721,{"$f":"C$14*(1+C$11%)^COUNT(C$37:C46)*(C$9>=COUNT(C$37:C46))","v":63164.069829173721},0]
["Operational Year 11",-65058.99192404894,{"$f":"C$14*(1+C$11%)^COUNT(C$37:C47)*(C$9>=COUNT(C$37:C47))","v":65058.99192404894},0]
["Operational Year 12",-67010.761681770397,{"$f":"C$14*(1+C$11%)^COUNT(C$37:C48)*(C$9>=COUNT(C$37:C48))","v":67010.761681770397},0]
["Operational Year 13",-69021.084532223511,{"$f":"C$14*(1+C$11%)^COUNT(C$37:C49)*(C$9>=COUNT(C$37:C49))","v":69021.084532223511},0]
["Operational Year 14",-71091.717068190221,{"$f":"C$14*(1+C$11%)^COUNT(C$37:C50)*(C$9>=COUNT(C$37:C50))","v":71091.717068190221},0]
["Operational Year 15",-73224.468580235931,{"$f":"C$14*(1+C$11%)^COUNT(C$37:C51)*(C$9>=COUNT(C$37:C51))","v":73224.468580235931},0]
["Operational Year 16",-75421.202637642986,{"$f":"C$14*(1+C$11%)^COUNT(C$37:C52)*(C$9>=COUNT(C$37:C52))","v":75421.202637642986},0]
["Operational Year 17",-77683.838716772283,{"$f":"C$14*(1+C$11%)^COUNT(C$37:C53)*(C$9>=COUNT(C$37:C53))","v":77683.838716772283},0]
["Operational Year 18",-80014.353878275448,{"$f":"C$14*(1+C$11%)^COUNT(C$37:C54)*(C$9>=COUNT(C$37:C54))","v":80014.353878275448},0]
["Operational Year 19",-82414.784494623716,{"$f":"C$14*(1+C$11%)^COUNT(C$37:C55)*(C$9>=COUNT(C$37:C55))","v":82414.784494623716},0]
["Operational Year 20",-84887.228029462422,{"$f":"C$14*(1+C$11%)^COUNT(C$37:C56)*(C$9>=COUNT(C$37:C56))","v":84887.228029462422},0]

{"sheet":"Environmental Impact","index":6,"n_rows":9,"n_cols":5,"rows_kept":9,"cut":false,"hidden":false,"merged":[[0,0,0,16383]]}
["Environmental Impact"]
[]
["Parameter","Unit","Value"]
["Annual Solar Yield","KWh/a",{"$f":"'Solar Energy Yield'!C24","v":900},null,"Extracted from tab \"Solar Energy Yield\", equivalent to saved energy"]
["Conversion efficiency","%",0.8,null,"For conventional energy system"]
["Fuel",null,"Natural gas"]
["GHG emissions","gCO2/kWh",{"$f":"IF(C6=\"Wood/wood waste\",410,IF(C6=\"Diesel\",254,IF(C6=\"Natural gas\",202,IF(C6=\"Anthracite (coal)\",356,IF(C6=\"Electricity\",453,\"\")))))","v":202}]
["GHG emissions","gCO2/kWh",0,null," (is only used, if \"User defined\" is selected in cell \"Fuel\")"]
["Saved GHG emissions","kgCO2/a",{"$f":"IF(C6=\"User defined\",C8*C4/C5,C7*C4/C5)/1000","v":227.25}]

{"sheet":"Data","index":7,"n_rows":769,"n_cols":13,"rows_kept":769,"cut":false,"hidden":true,"merged":[]}
["Help","collector","temperature","daily profile","weekly profile","volume","stoCap","sf","effC","effS",null,"Druck","Temperatur"]
[{"$f":"B2&C2&D2&E2&G2&H2","v":"ETC200continuous5days3000.5"},"ETC",200,"continuous","5days",19.309999999999999,300,0.5,5.4586711737600005E-2,5.1591169114499985E-2,null,"bar","°C"]
["ETC200continuous5days7000.5","ETC",200,"continuous","5days",45.055999999999997,700,0.5,6.8107564262799999E-2,6.4679675869999995E-2,null,0.01,7]
["ETC200continuous7days3000.5","ETC",200,"continuous","7days",19.309999999999999,300,0.5,6.8266653198900004E-2,6.4715833107499995E-2,null,0.05,32.9]
["ETC200continuous5days11000.5","ETC",200,"continuous","5days",70.802999999999997,1100,0.5,8.1628416787999994E-2,7.7768182625500004E-2,null,0.1,45.8]
["ETC200continuous7days7000.5","ETC",200,"continuous","7days",45.055999999999997,700,0.5,8.8905614872499997E-2,8.4120275217799995E-2,null,0.2,60.1]
["ETC200continuous7days3000.4","ETC",200,"continuous","7days",19.309999999999999,300,0.4,9.1994898555600002E-2,8.6108633155999995E-2,null,0.3,69.099999999999994]
["ETC200continuous5days15000.5","ETC",200,"continuous","5days",96.549000000000007,1500,0.5,9.2677753905400007E-2,8.82543787321E-2,null,0.4,75.900000000000006]
["ETC200continuous7days11000.5","ETC",200,"continuous","7days",70.802999999999997,1100,0.5,0.10042015956899999,9.5042722497499996E-2,null,0.5,81.3]
["ETC200continuous7days15000.5","ETC",200,"continuous","7days",96.549000000000007,1500,0.5,0.10588927044800001,0.100204852141,null,0.6,86]
["ETC150continuous5days3000.5","ETC",150,"continuous","5days",19.827000000000002,300,0.5,0.10904607448700002,9.9935916833999994E-2,null,0.7,90]
["ETC200continuous5days3000.4","ETC",200,"continuous","5days",19.309999999999999,300,0.4,0.113912888371,0.107157938832,null,0.8,93.5]
["ETC200continuous5days7000.4","ETC",200,"continuous","5days",45.055999999999997,700,0.4,0.113912888371,0.107157938832,null,0.9,96.7]
["ETC200continuous5days11000.4","ETC",200,"continuous","5days",70.802999999999997,1100,0.4,0.113912888371,0.107157938832,null,1,99.6]
["ETC200continuous7days3000.3","ETC",200,"continuous","7days",19.309999999999999,300,0.3,0.115783225494,0.107521501832,null,1.1000000000000001,102.3]
["ETC200continuous7days7000.4","ETC",200,"continuous","7days",45.055999999999997,700,0.4,0.117187647103,0.10982471667300001,null,1.2,104.8]
["ETC200continuous5days7000.3","ETC",200,"continuous","5days",45.055999999999997,700,0.3,0.12021927410200001,0.11140039824300001,null,1.3,107.1]
["ETC200continuous5days15000.4","ETC",200,"continuous","5days",96.549000000000007,1500,0.4,0.12548692874199999,0.117914465235,null,1.4,109.3]
["ETC200continuous7days11000.4","ETC",200,"continuous","7days",70.802999999999997,1100,0.4,0.131146784022,0.12315494831899999,null,1.5,111.4]
["ETC200continuous7days15000.4","ETC",200,"continuous","7days",96.549000000000007,1500,0.4,0.13658573812800001,0.12830614064900001,null,1.6,113.3]
["ETC200continuous5days11000.3","ETC",200,"continuous","5days",70.802999999999997,1100,0.3,0.13968803076899999,0.129314082499,null,1.7,115.2]
["ETC200continuous5days3000.3","ETC",200,"continuous","5days",19.309999999999999,300,0.3,0.144228560752,0.137734660648,null,1.8,116.9]
["ETC200continuous7days7000.3","ETC",200,"continuous","7days",45.055999999999997,700,0.3,0.14472790224900001,0.13467480572400001,null,1.9,118.6]
["ETC150continuous7days3000.5","ETC",150,"continuous","7days",19.827000000000002,300,0.5,0.14964737829999999,0.13715701085900001,null,2,120.2]
["ETC200continuous5days15000.3","ETC",200,"continuous","5days",96.549000000000007,1500,0.3,0.150359257902,0.13903016971500001,null,2.5,127.4]
["ETC100day5days3000.3","ETC",100,"day","5days",20.594999999999999,300,0.3,0.35997943777899999,0.32334728612800001,null,3,133.5]
["ETC100day5days3000.4","ETC",100,"day","5days",20.594999999999999,300,0.4,0.377775655903,0.33896878866999997,null,3.5,138.9]
["ETC100day5days3000.5","ETC",100,"day","5days",20.594999999999999,300,0.5,0.39430057204800001,0.355702750934,null,4,143.6]
["ETC100day5days7000.3","ETC",100,"day","5days",48.055999999999997,700,0.3,0.38015266571099998,0.34148288464400001,null,4.5,147.9]
["ETC100day5days7000.4","ETC",100,"day","5days",48.055999999999997,700,0.4,0.39364634897,0.35332975002299999,null,5,151.80000000000001]
["ETC100day5days7000.5","ETC",100,"day","5days",48.055999999999997,700,0.5,0.394599765243,0.35558243824500002,null,5.5,155.5]
["ETC100day5days11000.3","ETC",100,"day","5days",75.516999999999996,1100,0.3,0.40032589364299997,0.35961848316,null,6,158.80000000000001]
["ETC100day5days11000.4","ETC",100,"day","5days",75.516999999999996,1100,0.4,0.40951704203700001,0.36769071137600001,null,7,165]
["ETC100day5days11000.5","ETC",100,"day","5days",75.516999999999996,1100,0.5,0.41400768516499997,0.37226851981499998,null,8,170.4]
["ETC100day5days15000.3","ETC",100,"day","5days",102.977,1500,0.3,0.416593564591,0.37421289780599998,null,9,175.4]
["ETC100day5days15000.4","ETC",100,"day","5days",102.977,1500,0.4,0.42320387572500001,0.38000877792900001,null,10,179.9]
["ETC100day5days15000.5","ETC",100,"day","5days",102.977,1500,0.5,0.42701058095,0.38374454738000002,null,11,184.1]
["ETC100day7days3000.3","ETC",100,"day","7days",20.594999999999999,300,0.3,0.49610398143300005,0.44620765855200001,null,12,188]
["ETC100day7days3000.4","ETC",100,"day","7days",20.594999999999999,300,0.4,0.52246491713799992,0.46949024528300004,null,13,191.6]
["ETC100day7days3000.5","ETC",100,"day","7days",20.594999999999999,300,0.5,0.51076053925200005,0.46258072268700001,null,14,195]
["ETC100day7days7000.3","ETC",100,"day","7days",48.055999999999997,700,0.3,0.50832012964200002,0.45733362810700001,null,15,198.3]
["ETC100day7days7000.4","ETC",100,"day","7days",48.055999999999997,700,0.4,0.52945250179699999,0.47598458750400002,null,16,201.4]
["ETC100day7days7000.5","ETC",100,"day","7days",48.055999999999997,700,0.5,0.52570608257600004,0.47496424919300001,null,17,204.3]
["ETC100day7days11000.3","ETC",100,"day","7days",75.516999999999996,1100,0.3,0.52053627785099998,0.46845959766200002,null,18,207.1]
["ETC100day7days11000.4","ETC",100,"day","7days",75.516999999999996,1100,0.4,0.53644008645600005,0.48247892972500001,null,19,209.8]
["ETC100day7days11000.5","ETC",100,"day","7days",75.516999999999996,1100,0.5,0.54065162590000004,0.48734777569900001,null,20,212.4]
["ETC100day7days15000.3","ETC",100,"day","7days",102.977,1500,0.3,0.52813650772499998,0.47542326070099999,null,21,214.9]
["ETC100day7days15000.4","ETC",100,"day","7days",102.977,1500,0.4,0.54084476943600002,0.48663451915799999,null,25,233.9]
["ETC100day7days15000.5","ETC",100,"day","7days",102.977,1500,0.5,0.54606263433000002,0.49197043710600002,null,26,226]
["ETC150continuous5days3000.4","ETC",150,"continuous","5days",19.827000000000002,300,0.4,0.15049603262100003,0.13929514936700002,null,30,233.8]
["ETC200continuous7days11000.3","ETC",200,"continuous","7days",70.802999999999997,1100,0.3,0.15934898872299999,0.14831542283599999,null,31,235.7]
["ETC200continuous7days15000.3","ETC",200,"continuous","7days",96.549000000000007,1500,0.3,0.16429897592000001,0.15297103446599999,null,40,250.3]
["ETC150continuous5days7000.5","ETC",150,"continuous","5days",46.262,700,0.5,0.16443033623700001,0.151228706228,null,41,251.8]
["ETC100continuous5days3000.5","ETC",100,"continuous","5days",20.594999999999999,300,0.5,0.17995637818199994,0.16319611148700003,null,50,263.89999999999998]
["ETC150continuous7days3000.4","ETC",150,"continuous","7days",19.827000000000002,300,0.4,0.183162013229,0.16732721036000001,null,60,275.60000000000002]
["ETC150continuous7days7000.5","ETC",150,"continuous","7days",46.262,700,0.5,0.20060199205699999,0.184731319935,null,70,285.8]
["ETC150continuous5days7000.4","ETC",150,"continuous","5days",46.262,700,0.4,0.20611184619,0.18899713384200001,null,80,295]
["ETC150continuous5days3000.3","ETC",150,"continuous","5days",19.827000000000002,300,0.3,0.211621425157,0.19464977172300002,null,90,303.3]
["ETC150continuous5days11000.5","ETC",150,"continuous","5days",72.697999999999993,1100,0.5,0.21981459798700001,0.202521495622,null,100,311]
["ETC150continuous7days3000.3","ETC",150,"continuous","7days",19.827000000000002,300,0.3,0.232068266681,0.214529225612,null,150,342.1]
["ETC100continuous7days3000.5","ETC",100,"continuous","7days",20.594999999999999,300,0.5,0.23919331090000001,0.21475860635999999,null,200,365.7]
["ETC150continuous5days7000.3","ETC",150,"continuous","5days",46.262,700,0.3,0.24774120644700001,0.226408585873,null,221.2,374.2]
["ETC150continuous7days7000.4","ETC",150,"continuous","7days",46.262,700,0.4,0.24960342377399999,0.229661346558]
["ETC150continuous7days11000.5","ETC",150,"continuous","7days",72.697999999999993,1100,0.5,0.25141023080800001,0.23279936606500001]
["ETC150continuous5days11000.4","ETC",150,"continuous","5days",72.697999999999993,1100,0.4,0.26172765975899998,0.238699118317]
[{"$f":"B66&C66&D66&E66&G66&H66","v":"ETC150continuous5days15000.5"},"ETC",150,"continuous","5days",99.134,1500,0.5,0.263401349103,0.24145956168800001]
["ETC100continuous5days7000.5","ETC",100,"continuous","5days",48.055999999999997,700,0.5,0.26624877357799998,0.24099891096100001]
["ETC150continuous5days11000.3","ETC",150,"continuous","5days",72.697999999999993,1100,0.3,0.28386098773700003,0.25816740002299998]
["ETC50continuous5days3000.5","ETC",50,"continuous","5days",21.535,300,0.5,0.28602929291400003,0.25658162473699997]
["ETC100continuous7days3000.4","ETC",100,"continuous","7days",20.594999999999999,300,0.4,0.28896916872799999,0.26144892156999999]
["ETC150continuous5days15000.4","ETC",150,"continuous","5days",99.134,1500,0.4,0.29116464954100002,0.26457937948999999]
["ETC150continuous7days15000.5","ETC",150,"continuous","7days",99.134,1500,0.5,0.29671153435800002,0.27435102627000002]
["ETC150continuous5days15000.3","ETC",150,"continuous","5days",99.134,1500,0.3,0.30207960547399998,0.27419374446299999]
["ETC150day5days3000.3","ETC",150,"day","5days",19.827000000000002,300,0.3,0.25708979177199998,0.23273004650000001]
["ETC150day5days3000.4","ETC",150,"day","5days",19.827000000000002,300,0.4,0.25742002724800001,0.23391129448200004]
["ETC150day5days3000.5","ETC",150,"day","5days",19.827000000000002,300,0.5,0.21045015212599999,0.19619616236500001]
["ETC150day5days7000.3","ETC",150,"day","5days",46.262,700,0.3,0.27129113736799998,0.245557624148]
["ETC150day5days7000.4","ETC",150,"day","5days",46.262,700,0.4,0.27314908883,0.24787685277400001]
["ETC150day5days7000.5","ETC",150,"day","5days",46.262,700,0.5,0.256726591605,0.23451953527300001]
["ETC150day5days11000.3","ETC",150,"day","5days",72.697999999999993,1100,0.3,0.28549248296399998,0.258385201796]
{"$rows_left_out":689}