{"text_format":"2","workbook":"xlsx","n_sheets":8,"sheets":["START","Energy Demand","Available Area","Solar Energy Yield","Plant Cost","Economic Feasibility","Environmental Impact","Data"],"not_rendered":{"charts":1,"images":3,"macros":0,"external_links":0,"defined_names":1,"comments":0,"pivot_tables":0},"unopened":[],"bounds":{"document_bytes":16777216,"sheet_cells":100000,"run_cost":"one","rows_first":2000,"rows_last":500,"rows_between":2000,"halvings":0,"cell_chars":16384,"cell_head_chars":4096},"cells_cut":0,"cells_raw":0,"read":"whole","date_system":"1900"}

{"sheet":"START","index":0,"n_rows":15,"n_cols":2,"rows_kept":15,"cut":false,"hidden":false,"merged":[[0,0,0,16383]]}
["Solar Heat for Industrial Processes - Feasibility Calculator for Mexico"]
[]
[]
[null,"This tool has been created in the course of the project TrustCS."]
[]
[null,"This is a beta-version under development, no liability is assumed."]
[]
[null,"Information for usage:"]
[null,"Only cells surrounded by a black box can be edited!"]
[null,"For each integration point at a company, a seperate document has to be filled"]
[]
[null,"Company name"]
[null,"Integration point"]
[null,"Date"]
[null,"Comments"]

{"sheet":"Energy Demand","index":1,"n_rows":18,"n_cols":6,"rows_kept":18,"cut":false,"hidden":false,"merged":[[0,0,0,16383],[2,0,2,9]]}
["Effective Energy Demand"]
[]
["In industrial companies, solar thermal collectors can be integrated at supply or process level.\nFor each integration point a new excel sheet needs to be filled."]
["Parameter","Unit","Value"]
["Annual heat demand","MWh",3000]
["Annual Schedule - Annual operation days",null,365]
["Daily Schedule",null,"Continuous (0 am - 12 pm)"]
["Weekly Schedule",null,"5 Days/Week (MON-FRI)"]
["Daily operation hours",null,{"$f":"IF(C7=\"Daytime (8 am - 8 pm)\",12,IF(C7=\"Nighttime (8 pm - 8 am)\",12,24))","v":24}]
["Type of boiler or process",null,"Hot Water"]
[]
["Steam/Hot Water temperature (boiler outlet)","°C",50]
["Feed water temperature (boiler inlet)","°C",{"$f":"C12-30","v":20}]
["Pressure level","bar",3]
["Saturation temperature","°C",{"$f":"VLOOKUP(C14,Data!L3:M62,2)","v":133.5},"→",{"$f":"IF(C10=\"Hot Water\",IF(C15<C12,\"Consistency check failed!\",\"Consistency check okay!\"),IF(C15>C12,\"Consistency check failed!\",\"Consistency check okay!\"))","v":"Consistency check okay!"},{"$f":"IF(C10=\"Hot Water\",IF(C15<C12,\"Outlet temperature is above saturation temperature. Please adapt inputs!\",\"\"),IF(C15>C12,\"Outlet temperature is below saturation temperature. Please adapt inputs!\",\"\"))","v":""}]
["Heat transfer fluid used in solar system",null,{"$f":"IF(C10=\"Hot Water\",\"Water\",\"Thermal Oil\")","v":"Water"}]
["Heat capacity","kJ/kgK",{"$f":"IF(C16=\"Water\",4.19,2)","v":4.1900000000000004}]
["Mean thermal load","kW",{"$f":"C5*1000/C6/C9*IF(C8=\"5 Days/Week (MON-FRI)\",7/5,1)","v":479.45205479452051}]

{"sheet":"Available Area","index":2,"n_rows":5,"n_cols":3,"rows_kept":5,"cut":false,"hidden":false,"merged":[[0,0,0,16383],[2,0,2,5]]}
["Available Area"]
[]
["In this table, the available free space for the installation of solar thermal collectors is given. "]
["Parameter","Unit","Value"]
["Available free space","m²",4000]

{"sheet":"Solar Energy Yield","index":3,"n_rows":24,"n_cols":6,"rows_kept":24,"cut":false,"hidden":false,"merged":[[0,0,0,16383]]}
["Solar Energy Yield"]
[]
[]
["Parameter","Unit","Value"]
["Annual Direct Normal Irradiation (DNI) at project site","kWh/m²a",2575,null,"from https://globalsolaratlas.info"]
["Annual Global Horizontal Irradiation (GHI) at project site","kWh/m²a",2250,null,"from https://globalsolaratlas.info"]
[]
["Collector technology",null,"Flat Plate",null,"Suggested technology:",{"$f":"IF('Energy Demand'!C12<100,\"Evacuated Tube or Flat Plate\",IF('Energy Demand'!C12<150,\"Evacuated Tube, Parabolic trough or Linear Fresnel\",IF('Energy Demand'!C12>=150,\"Parabolic trough or Linear Fresnel\")))","v":"Evacuated Tube or Flat Plate"}]
["Technology type",null,{"$f":"IF(OR(C8=\"Evacuated Tube\",C8=\"Flat Plate\"),\"Stationary\",\"Tracking\")","v":"Stationary"},"→",{"$f":"IF(AND(C8=\"Flat Plate\",'Energy Demand'!C12>90),\"Consistency check failed!\",IF(AND(C8=\"Evacuated Tube\",'Energy Demand'!C12>140),\"Consistency check failed!\",IF(AND(OR(C8=\"Parabolic Trough\",C8=\"Linear Fresnel\"),OR('Energy Demand'!C12<120,'Energy Demand'!C12>250)),\"Consistency check failed!\",\"Consistency check okay!\")))","v":"Consistency check okay!"},{"$f":"IF(E9=\"Consistency check failed!\",\"This collector type is not suitable for the given temperature level!\",\"\")","v":""}]
[]
["Targeted solar fraction","%",30]
[]
["Storage size",null,"large"]
["Specific storage capacity","Wh/m²",{"$f":"IF(C13=\"very small\",300,IF(C13=\"small\",700,IF(C13=\"medium\",1100,1500)))","v":1500},null,"Storage capacity per m² solar field area"]
["Specific storage volume","l/m²",{"$f":"C14/('Energy Demand'!C17*('Energy Demand'!C12-'Energy Demand'!C13)*1000)*3600","v":42.959427207637226},null,"Storage volume per m² solar field area"]
[]
["System efficiency at location","%",{"$f":"VLOOKUP(IF(C8=\"Parabolic Trough\",\"PTC\",IF(C8=\"Linear Fresnel\",\"LFC\",IF(C8=\"Flat Plate\",\"FPC\",\"ETC\")))&'Energy Demand'!C12&IF('Energy Demand'!C7=\"Daytime (8 am - 8 pm)\",\"day\",\"continuous\")&IF('Energy Demand'!C8=\"5 Days/Week (MON-FRI)\",\"5days\",\"7days\")&C14&TEXT(C11/100,\"0.0\"),Data!A2:J1024,IF(C9=\"Tracking\",9,10),0)*100","v":42.324313965400002},null,"Based on simulation results for Mexico",{"$f":"IF(C8=\"Parabolic Trough\",\"PTC\",IF(C8=\"Linear Fresnel\",\"LFC\",IF(C8=\"Flat Plate\",\"FPC\",\"ETC\")))&'Energy Demand'!C12&IF('Energy Demand'!C7=\"Daytime (8 am - 8 pm)\",\"day\",\"continuous\")&IF('Energy Demand'!C8=\"5 Days/Week (MON-FRI)\",\"5days\",\"7days\")&C14&TEXT(C11/100,\"0.0\")","v":"FPC50continuous5days15000.3"}]
[]
["Solar field aperture area","m²",{"$f":"ROUNDUP(C11/100*'Energy Demand'!C5*1000/(C17/100*C5),0)","v":826}]
["Storage capacity","kWh",{"$f":"C19*C14/1000","v":1239}]
["Storage volume","m³",{"$f":"C15*C19/1000","v":35.484486873508352}]
[]
["Needed space for collector installation","m²",{"$f":"C19*IF(C8=\"Parabolic Trough\",2.5,IF(C8=\"Linear Fresnel\",1.6,1.8))","v":1486.8},"→",{"$f":"IF(C23>'Available Area'!C5,\"Consistency check failed!\",\"Consistency check okay!\")","v":"Consistency check okay!"},{"$f":"IF(C23>'Available Area'!C5,\"The available free space may not be sufficient for this solar thermal installation!\",\"The available free space is probably sufficient for this solar thermal installation\")","v":"The available free space is probably sufficient for this solar thermal installation"}]
["Annual solar energy yield","MWh",{"$f":"C11/100*'Energy Demand'!C5","v":900}]

{"sheet":"Plant Cost","index":4,"n_rows":11,"n_cols":7,"rows_kept":11,"cut":false,"hidden":false,"merged":[[0,0,0,16383]]}
["Plant Cost"]
[]
[]
["Parameter","Unit","Value"]
["Specific collector costs","US$/m²",350]
["Specific storage costs","US$/m³",1800]
["Absolute collector costs","US$",{"$f":"C5*'Solar Energy Yield'!C19","v":289100}]
["Absolute storage costs","US$",{"$f":"C6*'Solar Energy Yield'!C21","v":63872.076372315038}]
["Other costs","US$",0]
["Total capital expenditures (CAPEX)","US$",{"$f":"SUM(C7:C9)","v":352972.07637231506}]
["Operational expenditures (OPEX)","US$/a",7000,null,"Suggested:",{"$f":"0.02*C10","v":7059.4415274463017},"(~2% of CAPEX)"]

{"sheet":"Economic Feasibility","index":5,"n_rows":57,"n_cols":6,"rows_kept":57,"cut":false,"hidden":false,"merged":[[0,0,0,16383]]}
["Economic Feasibility"]
[]
[]
["Parameter","Unit","Value"]
["Annual yield","MWh",{"$f":"'Solar Energy Yield'!C24","v":900},null,"Extracted from tab \"Solar Energy Yield\""]
["CAPEX","US$",{"$f":"'Plant Cost'!C10","v":352972.07637231506},null,"Extracted from tab \"Cost Data\""]
["Operational expenditures","US$/a",{"$f":"'Plant Cost'!C11","v":7000},null,"Extracted from tab \"Cost Data\""]
["Conventional/comparative energy costs","US$/MWh",60]
["Project lifetime","a",20]
["Weighted Average Cost of Capital (WACC)","%/a",{"$f":"C24%*C25+(1-C24%)*C27","v":13.5},null,"calculated from debt ratio, cost of debt and equity: requires inputs of debt and equity rate"]
["Inflation rate ","%/a",3]
["Effective rate (of cost of capital, COC)","%/a",14,"→",{"$f":"IF(C12>C10,\"Consistency check okay!\",\"Consistency check failed!\")","v":"Consistency check okay!"},{"$f":"IF(C12>C10,\"WACC below COC.\",\"WACC above COC.\")","v":"WACC below COC."}]
["Discount rate adjusted for inflation","%/a",{"$f":"(((1+C12/100)/(1+C11/100))-1)*100","v":10.679611650485455}]
["Free cash from saved costs","US$/a",{"$f":"C8*C5-C7","v":47000}]
["Annuity factor"," -",{"$f":"1/PMT(C13%,C9,-1)","v":8.1331069281429738},null,"Sum of annual discount factors"]
["Project value based on effective rate","US$/a",{"$f":"C15*C14","v":382256.02562271978}]
["Project or investment margin","US$",{"$f":"C16-C6","v":29283.949250404723},"→",{"$f":"IF(C17>0,\"The project is economically viable.\",\"The project is not economically viable.\")","v":"The project is economically viable."}]
["Discounted payback period for CAPEX incl. COC","years",{"$f":"+(LN(C14)-LN(C14-C6*C13%))/LN(1+C13%)","v":15.962519506083011}]
["Simple payback period for CAPEX excl. COC","years",{"$f":"(LN(C14)-LN(C14-C6*(1/(1+C11%)-1)))/LN(1/(1+C11%))","v":6.69231587200556}]
["LCOH (average cost constant over lifetime)","US$/MWh",{"$f":"(C6*PMT(C12%,C9,-1)+C7)/C5","v":66.993158316147245}]
["LCOH (initial cost inflating over lifetime)","US$/MWh",{"$f":"(C6*PMT(C13%,C9,-1)+C7)/C5","v":55.999349119984103}]
[]
["Optional consistency checks"]
["Offtaker's debt ratio =debt/(debt+equity)","%",50]
["Offtaker's required rate on equity","%",16]
["Bank's offer of debt tenor","years",9]
["Bank's offer of client interest rate","%",11]
["Bank's offer of debt service coverage ratio","%",150]
["Debt volume based on Bank's market offer","US$",{"$f":"C14/C28%/PMT((1+C27%)/(1+C11%)-1,C26,-1)","v":197646.67032359683},null,"both debt volumes should compare in order of magnitude"]
["Debt volume based on offtaker's debt ratio","US$",{"$f":"C16*C24%","v":191128.01281135989},null,"both debt volumes should compare in order of magnitude"]
["Debt volume as average of 2 options above","US$",{"$f":"AVERAGE(C29:C30)","v":194387.34156747838}]
["Residual equity vol. to match Project Value","US$",{"$f":"C16-C31","v":187868.68405524141},null,"both equity volumes should compare in order of magnitude"]
["Possible equity vol. based on Offtaker's equity rate","US$",{"$f":"C14/PMT((1+C25%)/(1+C11%)-1,C9,-1) -C14/C28%/PMT((1+C25%)/(1+C11%)-1,C26,-1)","v":174743.27383724842},null,"both equity volumes should compare in order of magnitude"]
["Minimum equity vol. to cover CAPEX (informative)","US$",{"$f":"C6-C31","v":158584.73480483668}]
[]
["Cashflows of initial financing less CAPEX equal margin\nvs operational saved Costs spent on cost of capital (COC)","Financing vs COC","CAPEX vs Saved Energy Costs","Investment Margin"]
["Commercial Operation Date (COD)",{"$f":"NPV(C12%,C38:C57)","v":382256.02562272002},{"$f":"-C6","v":-352972.07637231506},{"$f":"-C37-B37","v":-29283.949250404956}]
["Operational Year 01",{"$f":"-C38","v":-48410},{"$f":"C$14*(1+C$11%)^COUNT(C$37:C37)*(C$9>=COUNT(C$37:C37))","v":48410},0]
["Operational Year 02",{"$f":"-C39","v":-49862.299999999996},{"$f":"C$14*(1+C$11%)^COUNT(C$37:C38)*(C$9>=COUNT(C$37:C38))","v":49862.299999999996},0]
["Operational Year 03",-51358.169000000002,{"$f":"C$14*(1+C$11%)^COUNT(C$37:C39)*(C$9>=COUNT(C$37:C39))","v":51358.169000000002},0]
["Operational Year 04",-52898.914069999999,{"$f":"C$14*(1+C$11%)^COUNT(C$37:C40)*(C$9>=COUNT(C$37:C40))","v":52898.914069999999},0]
["Operational Year 05",-54485.881492099994,{"$f":"C$14*(1+C$11%)^COUNT(C$37:C41)*(C$9>=COUNT(C$37:C41))","v":54485.881492099994},0]
["Operational Year 06",-56120.457936862993,{"$f":"C$14*(1+C$11%)^COUNT(C$37:C42)*(C$9>=COUNT(C$37:C42))","v":56120.457936862993},0]
["Operational Year 07",-57804.071674968887,{"$f":"C$14*(1+C$11%)^COUNT(C$37:C43)*(C$9>=COUNT(C$37:C43))","v":57804.071674968887},0]
["Operational Year 08",-59538.193825217946,{"$f":"C$14*(1+C$11%)^COUNT(C$37:C44)*(C$9>=COUNT(C$37:C44))","v":59538.193825217946},0]
["Operational Year 09",-61324.339639974489,{"$f":"C$14*(1+C$11%)^COUNT(C$37:C45)*(C$9>=COUNT(C$37:C45))","v":61324.339639974489},0]
["Operational Year 10",-63164.069829173721,{"$f":"C$14*(1+C$11%)^COUNT(C$37:C46)*(C$9>=COUNT(C$37:C46))","v":63164.069829173721},0]
["Operational Year 11",-65058.99192404894,{"$f":"C$14*(1+C$11%)^COUNT(C$37:C47)*(C$9>=COUNT(C$37:C47))","v":65058.99192404894},0]
["Operational Year 12",-67010.761681770397,{"$f":"C$14*(1+C$11%)^COUNT(C$37:C48)*(C$9>=COUNT(C$37:C48))","v":67010.761681770397},0]
["Operational Year 13",-69021.084532223511,{"$f":"C$14*(1+C$11%)^COUNT(C$37:C49)*(C$9>=COUNT(C$37:C49))","v":69021.084532223511},0]
["Operational Year 14",-71091.717068190221,{"$f":"C$14*(1+C$11%)^COUNT(C$37:C50)*(C$9>=COUNT(C$37:C50))","v":71091.717068190221},0]
["Operational Year 15",-73224.468580235931,{"$f":"C$14*(1+C$11%)^COUNT(C$37:C51)*(C$9>=COUNT(C$37:C51))","v":73224.468580235931},0]
["Operational Year 16",-75421.202637642986,{"$f":"C$14*(1+C$11%)^COUNT(C$37:C52)*(C$9>=COUNT(C$37:C52))","v":75421.202637642986},0]
["Operational Year 17",-77683.838716772283,{"$f":"C$14*(1+C$11%)^COUNT(C$37:C53)*(C$9>=COUNT(C$37:C53))","v":77683.838716772283},0]
["Operational Year 18",-80014.353878275448,{"$f":"C$14*(1+C$11%)^COUNT(C$37:C54)*(C$9>=COUNT(C$37:C54))","v":80014.353878275448},0]
["Operational Year 19",-82414.784494623716,{"$f":"C$14*(1+C$11%)^COUNT(C$37:C55)*(C$9>=COUNT(C$37:C55))","v":82414.784494623716},0]
["Operational Year 20",-84887.228029462422,{"$f":"C$14*(1+C$11%)^COUNT(C$37:C56)*(C$9>=COUNT(C$37:C56))","v":84887.228029462422},0]

{"sheet":"Environmental Impact","index":6,"n_rows":9,"n_cols":5,"rows_kept":9,"cut":false,"hidden":false,"merged":[[0,0,0,16383]]}
["Environmental Impact"]
[]
["Parameter","Unit","Value"]
["Annual Solar Yield","KWh/a",{"$f":"'Solar Energy Yield'!C24","v":900},null,"Extracted from tab \"Solar Energy Yield\", equivalent to saved energy"]
["Conversion efficiency","%",0.8,null,"For conventional energy system"]
["Fuel",null,"Natural gas"]
["GHG emissions","gCO2/kWh",{"$f":"IF(C6=\"Wood/wood waste\",410,IF(C6=\"Diesel\",254,IF(C6=\"Natural gas\",202,IF(C6=\"Anthracite (coal)\",356,IF(C6=\"Electricity\",453,\"\")))))","v":202}]
["GHG emissions","gCO2/kWh",0,null," (is only used, if \"User defined\" is selected in cell \"Fuel\")"]
["Saved GHG emissions","kgCO2/a",{"$f":"IF(C6=\"User defined\",C8*C4/C5,C7*C4/C5)/1000","v":227.25}]

{"sheet":"Data","index":7,"n_rows":769,"n_cols":13,"rows_kept":769,"cut":false,"hidden":true,"merged":[]}
["Help","collector","temperature","daily profile","weekly profile","volume","stoCap","sf","effC","effS",null,"Druck","Temperatur"]
[{"$f":"B2&C2&D2&E2&G2&H2","v":"ETC200continuous5days3000.5"},"ETC",200,"continuous","5days",19.309999999999999,300,0.5,5.4586711737600005E-2,5.1591169114499985E-2,null,"bar","°C"]
["ETC200continuous5days7000.5","ETC",200,"continuous","5days",45.055999999999997,700,0.5,6.8107564262799999E-2,6.4679675869999995E-2,null,0.01,7]
["ETC200continuous7days3000.5","ETC",200,"continuous","7days",19.309999999999999,300,0.5,6.8266653198900004E-2,6.4715833107499995E-2,null,0.05,32.9]
["ETC200continuous5days11000.5","ETC",200,"continuous","5days",70.802999999999997,1100,0.5,8.1628416787999994E-2,7.7768182625500004E-2,null,0.1,45.8]
["ETC200continuous7days7000.5","ETC",200,"continuous","7days",45.055999999999997,700,0.5,8.8905614872499997E-2,8.4120275217799995E-2,null,0.2,60.1]
["ETC200continuous7days3000.4","ETC",200,"continuous","7days",19.309999999999999,300,0.4,9.1994898555600002E-2,8.6108633155999995E-2,null,0.3,69.099999999999994]
["ETC200continuous5days15000.5","ETC",200,"continuous","5days",96.549000000000007,1500,0.5,9.2677753905400007E-2,8.82543787321E-2,null,0.4,75.900000000000006]
["ETC200continuous7days11000.5","ETC",200,"continuous","7days",70.802999999999997,1100,0.5,0.10042015956899999,9.5042722497499996E-2,null,0.5,81.3]
["ETC200continuous7days15000.5","ETC",200,"continuous","7days",96.549000000000007,1500,0.5,0.10588927044800001,0.100204852141,null,0.6,86]
["ETC150continuous5days3000.5","ETC",150,"continuous","5days",19.827000000000002,300,0.5,0.10904607448700002,9.9935916833999994E-2,null,0.7,90]
["ETC200continuous5days3000.4","ETC",200,"continuous","5days",19.309999999999999,300,0.4,0.113912888371,0.107157938832,null,0.8,93.5]
["ETC200continuous5days7000.4","ETC",200,"continuous","5days",45.055999999999997,700,0.4,0.113912888371,0.107157938832,null,0.9,96.7]
["ETC200continuous5days11000.4","ETC",200,"continuous","5days",70.802999999999997,1100,0.4,0.113912888371,0.107157938832,null,1,99.6]
["ETC200continuous7days3000.3","ETC",200,"continuous","7days",19.309999999999999,300,0.3,0.115783225494,0.107521501832,null,1.1000000000000001,102.3]
["ETC200continuous7days7000.4","ETC",200,"continuous","7days",45.055999999999997,700,0.4,0.117187647103,0.10982471667300001,null,1.2,104.8]
["ETC200continuous5days7000.3","ETC",200,"continuous","5days",45.055999999999997,700,0.3,0.12021927410200001,0.11140039824300001,null,1.3,107.1]
["ETC200continuous5days15000.4","ETC",200,"continuous","5days",96.549000000000007,1500,0.4,0.12548692874199999,0.117914465235,null,1.4,109.3]
["ETC200continuous7days11000.4","ETC",200,"continuous","7days",70.802999999999997,1100,0.4,0.131146784022,0.12315494831899999,null,1.5,111.4]
["ETC200continuous7days15000.4","ETC",200,"continuous","7days",96.549000000000007,1500,0.4,0.13658573812800001,0.12830614064900001,null,1.6,113.3]
["ETC200continuous5days11000.3","ETC",200,"continuous","5days",70.802999999999997,1100,0.3,0.13968803076899999,0.129314082499,null,1.7,115.2]
["ETC200continuous5days3000.3","ETC",200,"continuous","5days",19.309999999999999,300,0.3,0.144228560752,0.137734660648,null,1.8,116.9]
["ETC200continuous7days7000.3","ETC",200,"continuous","7days",45.055999999999997,700,0.3,0.14472790224900001,0.13467480572400001,null,1.9,118.6]
["ETC150continuous7days3000.5","ETC",150,"continuous","7days",19.827000000000002,300,0.5,0.14964737829999999,0.13715701085900001,null,2,120.2]
["ETC200continuous5days15000.3","ETC",200,"continuous","5days",96.549000000000007,1500,0.3,0.150359257902,0.13903016971500001,null,2.5,127.4]
["ETC100day5days3000.3","ETC",100,"day","5days",20.594999999999999,300,0.3,0.35997943777899999,0.32334728612800001,null,3,133.5]
["ETC100day5days3000.4","ETC",100,"day","5days",20.594999999999999,300,0.4,0.377775655903,0.33896878866999997,null,3.5,138.9]
["ETC100day5days3000.5","ETC",100,"day","5days",20.594999999999999,300,0.5,0.39430057204800001,0.355702750934,null,4,143.6]
["ETC100day5days7000.3","ETC",100,"day","5days",48.055999999999997,700,0.3,0.38015266571099998,0.34148288464400001,null,4.5,147.9]
["ETC100day5days7000.4","ETC",100,"day","5days",48.055999999999997,700,0.4,0.39364634897,0.35332975002299999,null,5,151.80000000000001]
["ETC100day5days7000.5","ETC",100,"day","5days",48.055999999999997,700,0.5,0.394599765243,0.35558243824500002,null,5.5,155.5]
["ETC100day5days11000.3","ETC",100,"day","5days",75.516999999999996,1100,0.3,0.40032589364299997,0.35961848316,null,6,158.80000000000001]
["ETC100day5days11000.4","ETC",100,"day","5days",75.516999999999996,1100,0.4,0.40951704203700001,0.36769071137600001,null,7,165]
["ETC100day5days11000.5","ETC",100,"day","5days",75.516999999999996,1100,0.5,0.41400768516499997,0.37226851981499998,null,8,170.4]
["ETC100day5days15000.3","ETC",100,"day","5days",102.977,1500,0.3,0.416593564591,0.37421289780599998,null,9,175.4]
["ETC100day5days15000.4","ETC",100,"day","5days",102.977,1500,0.4,0.42320387572500001,0.38000877792900001,null,10,179.9]
["ETC100day5days15000.5","ETC",100,"day","5days",102.977,1500,0.5,0.42701058095,0.38374454738000002,null,11,184.1]
["ETC100day7days3000.3","ETC",100,"day","7days",20.594999999999999,300,0.3,0.49610398143300005,0.44620765855200001,null,12,188]
["ETC100day7days3000.4","ETC",100,"day","7days",20.594999999999999,300,0.4,0.52246491713799992,0.46949024528300004,null,13,191.6]
["ETC100day7days3000.5","ETC",100,"day","7days",20.594999999999999,300,0.5,0.51076053925200005,0.46258072268700001,null,14,195]
["ETC100day7days7000.3","ETC",100,"day","7days",48.055999999999997,700,0.3,0.50832012964200002,0.45733362810700001,null,15,198.3]
["ETC100day7days7000.4","ETC",100,"day","7days",48.055999999999997,700,0.4,0.52945250179699999,0.47598458750400002,null,16,201.4]
["ETC100day7days7000.5","ETC",100,"day","7days",48.055999999999997,700,0.5,0.52570608257600004,0.47496424919300001,null,17,204.3]
["ETC100day7days11000.3","ETC",100,"day","7days",75.516999999999996,1100,0.3,0.52053627785099998,0.46845959766200002,null,18,207.1]
["ETC100day7days11000.4","ETC",100,"day","7days",75.516999999999996,1100,0.4,0.53644008645600005,0.48247892972500001,null,19,209.8]
["ETC100day7days11000.5","ETC",100,"day","7days",75.516999999999996,1100,0.5,0.54065162590000004,0.48734777569900001,null,20,212.4]
["ETC100day7days15000.3","ETC",100,"day","7days",102.977,1500,0.3,0.52813650772499998,0.47542326070099999,null,21,214.9]
["ETC100day7days15000.4","ETC",100,"day","7days",102.977,1500,0.4,0.54084476943600002,0.48663451915799999,null,25,233.9]
["ETC100day7days15000.5","ETC",100,"day","7days",102.977,1500,0.5,0.54606263433000002,0.49197043710600002,null,26,226]
["ETC150continuous5days3000.4","ETC",150,"continuous","5days",19.827000000000002,300,0.4,0.15049603262100003,0.13929514936700002,null,30,233.8]
["ETC200continuous7days11000.3","ETC",200,"continuous","7days",70.802999999999997,1100,0.3,0.15934898872299999,0.14831542283599999,null,31,235.7]
["ETC200continuous7days15000.3","ETC",200,"continuous","7days",96.549000000000007,1500,0.3,0.16429897592000001,0.15297103446599999,null,40,250.3]
["ETC150continuous5days7000.5","ETC",150,"continuous","5days",46.262,700,0.5,0.16443033623700001,0.151228706228,null,41,251.8]
["ETC100continuous5days3000.5","ETC",100,"continuous","5days",20.594999999999999,300,0.5,0.17995637818199994,0.16319611148700003,null,50,263.89999999999998]
["ETC150continuous7days3000.4","ETC",150,"continuous","7days",19.827000000000002,300,0.4,0.183162013229,0.16732721036000001,null,60,275.60000000000002]
["ETC150continuous7days7000.5","ETC",150,"continuous","7days",46.262,700,0.5,0.20060199205699999,0.184731319935,null,70,285.8]
["ETC150continuous5days7000.4","ETC",150,"continuous","5days",46.262,700,0.4,0.20611184619,0.18899713384200001,null,80,295]
["ETC150continuous5days3000.3","ETC",150,"continuous","5days",19.827000000000002,300,0.3,0.211621425157,0.19464977172300002,null,90,303.3]
["ETC150continuous5days11000.5","ETC",150,"continuous","5days",72.697999999999993,1100,0.5,0.21981459798700001,0.202521495622,null,100,311]
["ETC150continuous7days3000.3","ETC",150,"continuous","7days",19.827000000000002,300,0.3,0.232068266681,0.214529225612,null,150,342.1]
["ETC100continuous7days3000.5","ETC",100,"continuous","7days",20.594999999999999,300,0.5,0.23919331090000001,0.21475860635999999,null,200,365.7]
["ETC150continuous5days7000.3","ETC",150,"continuous","5days",46.262,700,0.3,0.24774120644700001,0.226408585873,null,221.2,374.2]
["ETC150continuous7days7000.4","ETC",150,"continuous","7days",46.262,700,0.4,0.24960342377399999,0.229661346558]
["ETC150continuous7days11000.5","ETC",150,"continuous","7days",72.697999999999993,1100,0.5,0.25141023080800001,0.23279936606500001]
["ETC150continuous5days11000.4","ETC",150,"continuous","5days",72.697999999999993,1100,0.4,0.26172765975899998,0.238699118317]
[{"$f":"B66&C66&D66&E66&G66&H66","v":"ETC150continuous5days15000.5"},"ETC",150,"continuous","5days",99.134,1500,0.5,0.263401349103,0.24145956168800001]
["ETC100continuous5days7000.5","ETC",100,"continuous","5days",48.055999999999997,700,0.5,0.26624877357799998,0.24099891096100001]
["ETC150continuous5days11000.3","ETC",150,"continuous","5days",72.697999999999993,1100,0.3,0.28386098773700003,0.25816740002299998]
["ETC50continuous5days3000.5","ETC",50,"continuous","5days",21.535,300,0.5,0.28602929291400003,0.25658162473699997]
["ETC100continuous7days3000.4","ETC",100,"continuous","7days",20.594999999999999,300,0.4,0.28896916872799999,0.26144892156999999]
["ETC150continuous5days15000.4","ETC",150,"continuous","5days",99.134,1500,0.4,0.29116464954100002,0.26457937948999999]
["ETC150continuous7days15000.5","ETC",150,"continuous","7days",99.134,1500,0.5,0.29671153435800002,0.27435102627000002]
["ETC150continuous5days15000.3","ETC",150,"continuous","5days",99.134,1500,0.3,0.30207960547399998,0.27419374446299999]
["ETC150day5days3000.3","ETC",150,"day","5days",19.827000000000002,300,0.3,0.25708979177199998,0.23273004650000001]
["ETC150day5days3000.4","ETC",150,"day","5days",19.827000000000002,300,0.4,0.25742002724800001,0.23391129448200004]
["ETC150day5days3000.5","ETC",150,"day","5days",19.827000000000002,300,0.5,0.21045015212599999,0.19619616236500001]
["ETC150day5days7000.3","ETC",150,"day","5days",46.262,700,0.3,0.27129113736799998,0.245557624148]
["ETC150day5days7000.4","ETC",150,"day","5days",46.262,700,0.4,0.27314908883,0.24787685277400001]
["ETC150day5days7000.5","ETC",150,"day","5days",46.262,700,0.5,0.256726591605,0.23451953527300001]
["ETC150day5days11000.3","ETC",150,"day","5days",72.697999999999993,1100,0.3,0.28549248296399998,0.258385201796]
["ETC150day5days11000.4","ETC",150,"day","5days",72.697999999999993,1100,0.4,0.28887815041199999,0.26184241106599998]
["ETC150day5days11000.5","ETC",150,"day","5days",72.697999999999993,1100,0.5,0.27966669133200001,0.25480723545299999]
["ETC150day5days15000.3","ETC",150,"day","5days",99.134,1500,0.3,0.29742142540400002,0.26919722445200001]
["ETC150day5days15000.4","ETC",150,"day","5days",99.134,1500,0.4,0.30033610868799998,0.27215853445299998]
["ETC150day5days15000.5","ETC",150,"day","5days",99.134,1500,0.5,0.29369013987699999,0.26716690699599999]
["ETC150day7days3000.3","ETC",150,"day","7days",19.827000000000002,300,0.3,0.38887487418700001,0.35312690884199999]
["ETC150day7days3000.4","ETC",150,"day","7days",19.827000000000002,300,0.4,0.34214863278299995,0.31269871769900004]
["ETC150day7days3000.5","ETC",150,"day","7days",19.827000000000002,300,0.5,0.31072451056400002,0.28587499178499998]
["ETC150day7days7000.3","ETC",150,"day","7days",46.262,700,0.3,0.357090700526,0.324347194728]
["ETC150day7days7000.4","ETC",150,"day","7days",46.262,700,0.4,0.35512770782699998,0.32374259126400001]
["ETC150day7days7000.5","ETC",150,"day","7days",46.262,700,0.5,0.332528361253,0.305156522145]
["ETC150day7days11000.3","ETC",150,"day","7days",72.697999999999993,1100,0.3,0.36395351464999998,0.33051326715000001]
["ETC150day7days11000.4","ETC",150,"day","7days",72.697999999999993,1100,0.4,0.36810678287100002,0.33478646482899999]
["ETC150day7days11000.5","ETC",150,"day","7days",72.697999999999993,1100,0.5,0.35433221194199999,0.32443805250500002]
["ETC150day7days15000.3","ETC",150,"day","7days",99.134,1500,0.3,0.36767008621000002,0.333944525888]
["ETC150day7days15000.4","ETC",150,"day","7days",99.134,1500,0.4,0.37243148865100001,0.33862029550299999]
["ETC150day7days15000.5","ETC",150,"day","7days",99.134,1500,0.5,0.36344568750599998,0.33240964176999999]
["ETC150continuous7days7000.3","ETC",150,"continuous","7days",46.262,700,0.3,0.30614957374700003,0.28181208588599999]
["ETC150continuous7days11000.4","ETC",150,"continuous","7days",72.697999999999993,1100,0.4,0.30643959055999997,0.281774288948]
["ETC100continuous7days7000.5","ETC",100,"continuous","7days",48.055999999999997,700,0.5,0.32610385893100002,0.29517729479900001]
["ETC100continuous5days3000.4","ETC",100,"continuous","5days",20.594999999999999,300,0.4,0.32776731448500002,0.27941147331999999]
["ETC100continuous5days7000.4","ETC",100,"continuous","5days",48.055999999999997,700,0.4,0.328521147633,0.29783715919300002]
["ETC150continuous7days15000.4","ETC",150,"continuous","7days",99.134,1500,0.4,0.34271004575500003,0.31367875489699998]
["ETC150continuous7days11000.3","ETC",150,"continuous","7days",72.697999999999993,1100,0.3,0.34797287645000002,0.31827549452600001]
["ETC50continuous7days3000.5","ETC",50,"continuous","7days",21.535,300,0.5,0.34976097912000004,0.31367105991499999]
["ETC100continuous5days11000.5","ETC",100,"continuous","5days",75.516999999999996,1100,0.5,0.35254116897400001,0.318801710435]
["ETC150continuous7days15000.3","ETC",150,"continuous","7days",99.134,1500,0.3,0.366276426584,0.33397531851700002]
["ETC50continuous5days7000.5","ETC",50,"continuous","5days",50.247999999999998,700,0.5,0.37159148479600002,0.33335572524399998]
["ETC100continuous5days3000.3","ETC",100,"continuous","5days",20.594999999999999,300,0.3,0.37334964306899998,0.33161847508800002]
["ETC100continuous5days7000.3","ETC",100,"continuous","5days",48.055999999999997,700,0.3,0.38517565606600002,0.347759176793]
["ETC100continuous5days11000.4","ETC",100,"continuous","5days",75.516999999999996,1100,0.4,0.39287104265799999,0.35464918748099999]
["ETC100continuous5days15000.5","ETC",100,"continuous","5days",102.977,1500,0.5,0.40075621946899997,0.36216902036999998]
["ETC100continuous7days7000.4","ETC",100,"continuous","7days",48.055999999999997,700,0.4,0.40838726331699998,0.372190972856]
["ETC50continuous5days3000.4","ETC",50,"continuous","5days",21.535,300,0.4,0.41132771731500001,0.37979159016199998]
["ETC100continuous5days11000.3","ETC",100,"continuous","5days",75.516999999999996,1100,0.3,0.415207489358,0.37351958889800002]
["ETC100continuous7days11000.5","ETC",100,"continuous","7days",75.516999999999996,1100,0.5,0.42034384646099998,0.38207005234300001]
["ETC100continuous7days3000.3","ETC",100,"continuous","7days",20.594999999999999,300,0.3,0.42126874725199998,0.38595128672500001]
["ETC100continuous5days15000.4","ETC",100,"continuous","5days",102.977,1500,0.4,0.427921402492,0.38542974003300001]
["ETC100continuous5days15000.3","ETC",100,"continuous","5days",102.977,1500,0.3,0.433284039861,0.38922647581600001]
["ETC50continuous5days7000.4","ETC",50,"continuous","5days",50.247999999999998,700,0.4,0.44148948123300003,0.395872056922]
["ETC50continuous7days3000.4","ETC",50,"continuous","7days",21.535,300,0.4,0.44407287612399998,0.40059424973199997]
["ETC200day5days11000.3","ETC",200,"day","5days",70.802999999999997,1100,0.3,0.13682593532000001,0.12688044459699999]
["ETC200day5days3000.4","ETC",200,"day","5days",19.309999999999999,300,0.4,0.105287025824,9.9820377983800002E-2]
["ETC200day5days3000.5","ETC",200,"day","5days",19.309999999999999,300,0.5,5.6280399929700006E-2,5.8251097175250011E-2]
["ETC200day5days15000.3","ETC",200,"day","5days",96.549000000000007,1500,0.3,0.15662590258600001,0.143214190075]
["ETC200day5days7000.4","ETC",200,"day","5days",45.055999999999997,700,0.4,0.105287025824,9.9820377983800002E-2]
["ETC200day5days7000.5","ETC",200,"day","5days",45.055999999999997,700,0.5,7.0446670680800003E-2,7.1259608445200004E-2]
["ETC200day5days3000.3","ETC",200,"day","5days",19.309999999999999,300,0.3,0.175827841007,0.15552190505399999]
["ETC200day5days11000.4","ETC",200,"day","5days",70.802999999999997,1100,0.4,0.105287025824,9.9820377983800002E-2]
[{"$f":"B130&C130&D130&E130&G130&H130","v":"ETC200day5days11000.5"},"ETC",200,"day","5days",70.802999999999997,1100,0.5,8.4612941431899999E-2,8.4268119715149997E-2]
["ETC200day5days7000.3","ETC",200,"day","5days",45.055999999999997,700,0.3,0.13879942346499999,0.12705926332699999]
["ETC200day5days15000.4","ETC",200,"day","5days",96.549000000000007,1500,0.4,0.155061646099,0.14188931659699999]
["ETC200day5days15000.5","ETC",200,"day","5days",96.549000000000007,1500,0.5,9.8779212182999995E-2,9.7276630985100004E-2]
["ETC200day7days3000.3","ETC",200,"day","7days",19.309999999999999,300,0.3,0.15408432483199999,0.142897636228]
["ETC200day7days3000.4","ETC",200,"day","7days",19.309999999999999,300,0.4,0.110409064091,0.106894544726]
["ETC200day7days3000.5","ETC",200,"day","7days",19.309999999999999,300,0.5,3.6218251732499998E-2,3.6795994609099998E-2]
["ETC200day7days7000.3","ETC",200,"day","7days",45.055999999999997,700,0.3,0.17393030656299999,0.15981831752100001]
["ETC200day7days7000.4","ETC",200,"day","7days",45.055999999999997,700,0.4,0.13129756466799999,0.12758674970799999]
["ETC200day7days7000.5","ETC",200,"day","7days",45.055999999999997,700,0.5,4.3658991026400001E-2,4.5616797785600002E-2]
["ETC200day7days11000.3","ETC",200,"day","7days",70.802999999999997,1100,0.3,0.17850490649699999,0.16378701085700001]
["ETC200day7days11000.4","ETC",200,"day","7days",70.802999999999997,1100,0.4,0.13344549943299999,0.130244221222]
["ETC200day7days11000.5","ETC",200,"day","7days",70.802999999999997,1100,0.5,4.50432656665E-2,4.7186902982700001E-2]
["ETC200day7days15000.3","ETC",200,"day","7days",96.549000000000007,1500,0.3,0.18009900336599999,0.16524507178699999]
["ETC200day7days15000.4","ETC",200,"day","7days",96.549000000000007,1500,0.4,0.16000832388299999,0.150382763305]
["ETC200day7days15000.5","ETC",200,"day","7days",96.549000000000007,1500,0.5,6.1746717695200001E-2,6.3980094624000006E-2]
["ETC50continuous5days3000.3","ETC",50,"continuous","5days",21.535,300,0.3,0.45339056068099998,0.40613688950000004]
["ETC50continuous5days11000.5","ETC",50,"continuous","5days",78.962000000000003,1100,0.5,0.457153676678,0.41012982575099999]
["ETC50continuous7days7000.5","ETC",50,"continuous","7days",50.247999999999998,700,0.5,0.46077541782100001,0.41410912271700001]
["ETC50continuous5days7000.3","ETC",50,"continuous","5days",50.247999999999998,700,0.3,0.47382266117299998,0.42375581752800001]
["ETC100continuous7days11000.4","ETC",100,"continuous","7days",75.516999999999996,1100,0.4,0.48718366697799997,0.44206471893900001]
["ETC100continuous7days15000.5","ETC",100,"continuous","7days",102.977,1500,0.5,0.488610723124,0.44299937912499998]
["ETC50continuous5days11000.4","ETC",50,"continuous","5days",78.962000000000003,1100,0.4,0.49120898903299998,0.43903436177999999]
["ETC50continuous5days11000.3","ETC",50,"continuous","5days",78.962000000000003,1100,0.3,0.49425476166499999,0.44137474555599998]
["ETC50continuous5days15000.5","ETC",50,"continuous","5days",107.675,1500,0.5,0.50053176702699997,0.44845317155999997]
["ETC100continuous7days7000.3","ETC",100,"continuous","7days",48.055999999999997,700,0.3,0.50057805354899998,0.45420333870700003]
["ETC50continuous5days15000.3","ETC",50,"continuous","5days",107.675,1500,0.3,0.50866016005900005,0.45396357928199998]
["ETC50continuous5days15000.4","ETC",50,"continuous","5days",107.675,1500,0.4,0.51466743928600001,0.45964797127899998]
["ETC100continuous7days15000.4","ETC",100,"continuous","7days",102.977,1500,0.4,0.52973039095200003,0.479384617357]
["ETC100continuous7days11000.3","ETC",100,"continuous","7days",75.516999999999996,1100,0.3,0.53553968801700003,0.48333771092400002]
["ETC100continuous7days15000.3","ETC",100,"continuous","7days",102.977,1500,0.3,0.55048563026399999,0.49595671752999998]
["ETC50continuous7days11000.5","ETC",50,"continuous","7days",78.962000000000003,1100,0.5,0.57178985652199998,0.51454718551900003]
["ETC50continuous7days7000.4","ETC",50,"continuous","7days",50.247999999999998,700,0.4,0.57396038189099996,0.51623208879399995]
["ETC50continuous7days3000.3","ETC",50,"continuous","7days",21.535,300,0.3,0.60655322475399998,0.548797908956]
["ETC50continuous7days15000.5","ETC",50,"continuous","7days",107.675,1500,0.5,0.62736075942500003,0.563802569137]
["ETC50continuous7days7000.3","ETC",50,"continuous","7days",50.247999999999998,700,0.3,0.63414120169999999,0.56847333365999997]
["ETC50continuous7days11000.4","ETC",50,"continuous","7days",78.962000000000003,1100,0.4,0.636142934351,0.57044013626500001]
["ETC50continuous7days11000.3","ETC",50,"continuous","7days",78.962000000000003,1100,0.3,0.650072269373,0.58178012473399998]
["ETC50continuous7days15000.3","ETC",50,"continuous","7days",107.675,1500,0.3,0.65694242207099995,0.58758883147300001]
["ETC50continuous7days15000.4","ETC",50,"continuous","7days",107.675,1500,0.4,0.66096298068500003,0.59168801337800003]
["ETC50day5days3000.3","ETC",50,"day","5days",21.535,300,0.3,0.41039006768800002,0.36628365616600006]
["ETC50day5days3000.4","ETC",50,"day","5days",21.535,300,0.4,0.43160951713800005,0.38507200802999997]
["ETC50day5days3000.5","ETC",50,"day","5days",21.535,300,0.5,0.45283228463500003,0.403802419277]
["ETC50day5days7000.3","ETC",50,"day","5days",50.247999999999998,700,0.3,0.436944542775,0.39008769597800003]
["ETC50day5days7000.4","ETC",50,"day","5days",50.247999999999998,700,0.4,0.45317583941700001,0.40443283415699999]
["ETC50day5days7000.5","ETC",50,"day","5days",50.247999999999998,700,0.5,0.46944310435600001,0.41878672320499999]
["ETC50day5days11000.3","ETC",50,"day","5days",78.962000000000003,1100,0.3,0.46349901786199998,0.41389173578999999]
["ETC50day5days11000.4","ETC",50,"day","5days",78.962000000000003,1100,0.4,0.47474216169599998,0.42379366028400001]
["ETC50day5days11000.5","ETC",50,"day","5days",78.962000000000003,1100,0.5,0.48605392407699999,0.43377102713299998]
["ETC50day5days15000.3","ETC",50,"day","5days",107.675,1500,0.3,0.48374927668000001,0.43192930625199999]
["ETC50day5days15000.4","ETC",50,"day","5days",107.675,1500,0.4,0.49201376626400001,0.43920331593299999]
["ETC50day5days15000.5","ETC",50,"day","5days",107.675,1500,0.5,0.50037470646500004,0.44656413116900001]
["ETC50day7days3000.3","ETC",50,"day","7days",21.535,300,0.3,0.57022405368000006,0.50938387381899997]
["ETC50day7days3000.4","ETC",50,"day","7days",21.535,300,0.4,0.60101495234600011,0.53664641781599998]
["ETC50day7days3000.5","ETC",50,"day","7days",21.535,300,0.5,0.63195946993999996,0.56401600101899985]
["ETC50day7days7000.3","ETC",50,"day","7days",50.247999999999998,700,0.3,0.59015343094700001,0.52738422922799999]
["ETC50day7days7000.4","ETC",50,"day","7days",50.247999999999998,700,0.4,0.61464858704900005,0.54906214872199999]
["ETC50day7days7000.5","ETC",50,"day","7days",50.247999999999998,700,0.5,0.63906358339199998,0.57065857419199995]
["ETC50day7days11000.3","ETC",50,"day","7days",78.962000000000003,1100,0.3,0.61008280821399996,0.54538458463700001]
["ETC50day7days11000.4","ETC",50,"day","7days",78.962000000000003,1100,0.4,0.62828222175199999,0.561477879628]
["ETC50day7days11000.5","ETC",50,"day","7days",78.962000000000003,1100,0.5,0.64616769684399999,0.57730114736500004]
["ETC50day7days15000.3","ETC",50,"day","7days",107.675,1500,0.3,0.62200315765199998,0.55612855606300005]
["ETC50day7days15000.4","ETC",50,"day","7days",107.675,1500,0.4,0.63624503391200005,0.56871982076500005]
["ETC50day7days15000.5","ETC",50,"day","7days",107.675,1500,0.5,0.65052446957800003,0.58138394820200001]
[{"$f":"B194&C194&D194&E194&G194&H194","v":"FPC200day5days3000.3"},"FPC",200,"day","5days",19.309999999999999,300,0.3,5.3615776501999999E-3,4.7302466627399996E-3]
["FPC200day5days7000.3","FPC",200,"day","5days",45.055999999999997,700,0.3,5.3615776501999999E-3,4.7302466627399996E-3]
["FPC200day5days11000.3","FPC",200,"day","5days",70.802999999999997,1100,0.3,5.3615776501999999E-3,4.7302466627399996E-3]
["FPC200day5days15000.3","FPC",200,"day","5days",96.549000000000007,1500,0.3,5.3615776501999999E-3,4.7302466627399996E-3]
["FPC200day5days3000.4","FPC",200,"day","5days",19.309999999999999,300,0.4,7.14877020026E-3,6.3069955503299996E-3]
["FPC200day5days7000.4","FPC",200,"day","5days",45.055999999999997,700,0.4,7.14877020026E-3,6.3069955503299996E-3]
["FPC200day5days11000.4","FPC",200,"day","5days",70.802999999999997,1100,0.4,7.14877020026E-3,6.3069955503299996E-3]
["FPC200day5days15000.4","FPC",200,"day","5days",96.549000000000007,1500,0.4,7.14877020026E-3,6.3069955503299996E-3]
["FPC200day7days11000.3","FPC",200,"day","7days",70.802999999999997,1100,0.3,7.7445010502799998E-3,6.8325785128500001E-3]
["FPC200day7days15000.3","FPC",200,"day","7days",96.549000000000007,1500,0.3,7.7445010502799998E-3,6.8325785128500001E-3]
["FPC200day7days3000.3","FPC",200,"day","7days",19.309999999999999,300,0.3,7.7445010502799998E-3,6.8325785128500001E-3]
["FPC200day7days7000.3","FPC",200,"day","7days",45.055999999999997,700,0.3,7.7445010502799998E-3,6.8325785128500001E-3]
["FPC200day5days11000.5","FPC",200,"day","5days",70.802999999999997,1100,0.5,9.5316936003499997E-3,8.4093274004299993E-3]
["FPC200day5days15000.5","FPC",200,"day","5days",96.549000000000007,1500,0.5,9.5316936003499997E-3,8.4093274004299993E-3]
["FPC200day5days3000.5","FPC",200,"day","5days",19.309999999999999,300,0.5,9.5316936003499997E-3,8.4093274004299993E-3]
["FPC200day5days7000.5","FPC",200,"day","5days",45.055999999999997,700,0.5,9.5316936003499997E-3,8.4093274004299993E-3]
["FPC200day7days11000.4","FPC",200,"day","7days",70.802999999999997,1100,0.4,1.01274244504E-2,8.9349103629599996E-3]
["FPC200day7days15000.4","FPC",200,"day","7days",96.549000000000007,1500,0.4,1.01274244504E-2,8.9349103629599996E-3]
["FPC200day7days3000.4","FPC",200,"day","7days",19.309999999999999,300,0.4,1.01274244504E-2,8.9349103629599996E-3]
["FPC200day7days7000.4","FPC",200,"day","7days",45.055999999999997,700,0.4,1.01274244504E-2,8.9349103629599996E-3]
["FPC150day5days3000.5","FPC",150,"day","5days",19.827000000000002,300,0.5,1.06391133124E-2,9.6654115580700004E-3]
["FPC150day5days7000.5","FPC",150,"day","5days",46.262,700,0.5,1.06391133124E-2,9.6654115580700004E-3]
["FPC150day5days11000.5","FPC",150,"day","5days",72.697999999999993,1100,0.5,1.0985181972399999E-2,1.00579378573E-2]
["FPC200continuous5days11000.3","FPC",200,"continuous","5days",70.802999999999997,1100,0.3,1.13188861504E-2,9.9860762880099995E-3]
["FPC200continuous5days15000.3","FPC",200,"continuous","5days",96.549000000000007,1500,0.3,1.13188861504E-2,9.9860762880099995E-3]
["FPC200continuous5days3000.3","FPC",200,"continuous","5days",19.309999999999999,300,0.3,1.13188861504E-2,9.9860762880099995E-3]
["FPC200continuous5days7000.3","FPC",200,"continuous","5days",45.055999999999997,700,0.3,1.13188861504E-2,9.9860762880099995E-3]
["FPC150day5days15000.5","FPC",150,"day","5days",99.134,1500,0.5,1.18157467565E-2,1.1000000975599999E-2]
["FPC200day7days11000.5","FPC",200,"day","7days",70.802999999999997,1100,0.5,1.31060787005E-2,1.15628251756E-2]
["FPC200day7days15000.5","FPC",200,"day","7days",96.549000000000007,1500,0.5,1.31060787005E-2,1.15628251756E-2]
["FPC200day7days3000.5","FPC",200,"day","7days",19.309999999999999,300,0.5,1.31060787005E-2,1.15628251756E-2]
["FPC200day7days7000.5","FPC",200,"day","7days",45.055999999999997,700,0.5,1.31060787005E-2,1.15628251756E-2]
["FPC150day5days3000.4","FPC",150,"day","5days",19.827000000000002,300,0.4,1.34003523287E-2,1.33305463313E-2]
["FPC150day5days7000.4","FPC",150,"day","5days",46.262,700,0.4,1.34003523287E-2,1.33305463313E-2]
["FPC150day7days3000.5","FPC",150,"day","7days",19.827000000000002,300,0.5,1.4075070948499999E-2,1.26618988135E-2]
["FPC150day7days7000.5","FPC",150,"day","7days",46.262,700,0.5,1.4075070948499999E-2,1.26618988135E-2]
["FPC150day7days15000.5","FPC",150,"day","7days",99.134,1500,0.5,1.42827121446E-2,1.2897414593100001E-2]
["FPC150day7days11000.5","FPC",150,"day","7days",72.697999999999993,1100,0.5,1.46287808046E-2,1.32899408923E-2]
["FPC200continuous5days11000.4","FPC",200,"continuous","5days",70.802999999999997,1100,0.4,1.4893271250500001E-2,1.31395740632E-2]
["FPC200continuous5days15000.4","FPC",200,"continuous","5days",96.549000000000007,1500,0.4,1.4893271250500001E-2,1.31395740632E-2]
["FPC200continuous5days3000.4","FPC",200,"continuous","5days",19.309999999999999,300,0.4,1.4893271250500001E-2,1.31395740632E-2]
["FPC200continuous5days7000.4","FPC",200,"continuous","5days",45.055999999999997,700,0.4,1.4893271250500001E-2,1.31395740632E-2]
["FPC200continuous7days11000.3","FPC",200,"continuous","7days",70.802999999999997,1100,0.3,1.5489002100600001E-2,1.36651570257E-2]
["FPC200continuous7days15000.3","FPC",200,"continuous","7days",96.549000000000007,1500,0.3,1.5489002100600001E-2,1.36651570257E-2]
["FPC200continuous7days3000.3","FPC",200,"continuous","7days",19.309999999999999,300,0.3,1.5489002100600001E-2,1.36651570257E-2]
["FPC200continuous7days7000.3","FPC",200,"continuous","7days",45.055999999999997,700,0.3,1.5489002100600001E-2,1.36651570257E-2]
["FPC150day7days3000.4","FPC",150,"day","7days",19.827000000000002,300,0.4,1.59179441967E-2,1.54691382578E-2]
["FPC150day7days7000.4","FPC",150,"day","7days",46.262,700,0.4,1.59179441967E-2,1.54691382578E-2]
["FPC150day7days15000.4","FPC",150,"day","7days",99.134,1500,0.4,1.6279272853400001E-2,1.5867761665999999E-2]
["FPC150day5days11000.4","FPC",150,"day","5days",72.697999999999993,1100,0.4,1.6305154084799999E-2,1.64234941679E-2]
["FPC150day7days11000.4","FPC",150,"day","7days",72.697999999999993,1100,0.4,1.7009016418100001E-2,1.66169887678E-2]
["FPC150day5days15000.4","FPC",150,"day","5days",99.134,1500,0.4,1.71520663595E-2,1.7473790933699999E-2]
["FPC200continuous5days11000.5","FPC",200,"continuous","5days",70.802999999999997,1100,0.5,1.8467656350699999E-2,1.6293071838300002E-2]
["FPC200continuous5days15000.5","FPC",200,"continuous","5days",96.549000000000007,1500,0.5,1.8467656350699999E-2,1.6293071838300002E-2]
["FPC200continuous5days3000.5","FPC",200,"continuous","5days",19.309999999999999,300,0.5,1.8467656350699999E-2,1.6293071838300002E-2]
["FPC200continuous5days7000.5","FPC",200,"continuous","5days",45.055999999999997,700,0.5,1.8467656350699999E-2,1.6293071838300002E-2]
["FPC200continuous7days11000.4","FPC",200,"continuous","7days",70.802999999999997,1100,0.4,2.08505797508E-2,1.8395403688400001E-2]
["FPC200continuous7days15000.4","FPC",200,"continuous","7days",96.549000000000007,1500,0.4,2.08505797508E-2,1.8395403688400001E-2]
["FPC200continuous7days3000.4","FPC",200,"continuous","7days",19.309999999999999,300,0.4,2.08505797508E-2,1.8395403688400001E-2]
["FPC200continuous7days7000.4","FPC",200,"continuous","7days",45.055999999999997,700,0.4,2.08505797508E-2,1.8395403688400001E-2]
["FPC150continuous5days3000.5","FPC",150,"continuous","5days",19.827000000000002,300,0.5,2.48264559178E-2,2.30308727023E-2]
["FPC150continuous5days7000.5","FPC",150,"continuous","5days",46.262,700,0.5,2.48264559178E-2,2.30308727023E-2]
["FPC200continuous7days11000.5","FPC",200,"continuous","7days",70.802999999999997,1100,0.5,2.6212157401E-2,2.3125650351200001E-2]
["FPC200continuous7days15000.5","FPC",200,"continuous","7days",96.549000000000007,1500,0.5,2.6212157401E-2,2.3125650351200001E-2]
[{"$f":"B258&C258&D258&E258&G258&H258","v":"FPC200continuous7days3000.5"},"FPC",200,"continuous","7days",19.309999999999999,300,0.5,2.6212157401E-2,2.3125650351200001E-2]
["FPC200continuous7days7000.5","FPC",200,"continuous","7days",45.055999999999997,700,0.5,2.6212157401E-2,2.3125650351200001E-2]
["FPC150continuous5days11000.5","FPC",150,"continuous","5days",72.697999999999993,1100,0.5,2.6692203334299999E-2,2.4921448542099999E-2]
["FPC150continuous5days15000.5","FPC",150,"continuous","5days",99.134,1500,0.5,2.7758686270099999E-2,2.5995712616700001E-2]
["FPC150continuous5days3000.4","FPC",150,"continuous","5days",19.827000000000002,300,0.4,2.78551422278E-2,2.6192960653099999E-2]
["FPC150day7days3000.3","FPC",150,"day","7days",19.827000000000002,300,0.3,2.79197140042E-2,2.78688215627E-2]
["FPC150day5days7000.3","FPC",150,"day","5days",46.262,700,0.3,2.82421718188E-2,2.8497253302400001E-2]
["FPC150day7days7000.3","FPC",150,"day","7days",46.262,700,0.3,2.8786249777600002E-2,2.8883611399199999E-2]
["FPC150continuous5days7000.4","FPC",150,"continuous","5days",46.262,700,0.4,3.06475484546E-2,2.88817550284E-2]
["FPC150continuous7days3000.5","FPC",150,"continuous","7days",19.827000000000002,300,0.5,3.1536676704400003E-2,2.89065808009E-2]
["FPC150day7days11000.3","FPC",150,"day","7days",72.697999999999993,1100,0.3,3.2261717236700002E-2,3.2222092967499998E-2]
["FPC150day7days15000.3","FPC",150,"day","7days",99.134,1500,0.3,3.2566711418900003E-2,3.2536056609800003E-2]
["FPC150continuous5days11000.4","FPC",150,"continuous","5days",72.697999999999993,1100,0.4,3.34399546814E-2,3.15705494037E-2]
["FPC150continuous7days3000.4","FPC",150,"continuous","7days",19.827000000000002,300,0.4,3.4901200884399998E-2,3.2875728582600003E-2]
["FPC150day5days11000.3","FPC",150,"day","5days",72.697999999999993,1100,0.3,3.5043393859099999E-2,3.5168957354499999E-2]
["FPC150continuous5days3000.3","FPC",150,"continuous","5days",19.827000000000002,300,0.3,3.5253908228699997E-2,3.3038742066E-2]
["FPC150continuous7days7000.5","FPC",150,"continuous","7days",46.262,700,0.5,3.5519349685900002E-2,3.2826030545800002E-2]
["FPC150continuous5days15000.4","FPC",150,"continuous","5days",99.134,1500,0.4,3.5718171940000001E-2,3.3702481644900001E-2]
["FPC150continuous7days11000.5","FPC",150,"continuous","7days",72.697999999999993,1100,0.5,3.6689751823900003E-2,3.39865303279E-2]
["FPC150continuous7days15000.5","FPC",150,"continuous","7days",99.134,1500,0.5,3.7607923145500002E-2,3.4899348810899997E-2]
["FPC150continuous5days7000.3","FPC",150,"continuous","5days",46.262,700,0.3,3.9020883512199997E-2,3.65985435718E-2]
["FPC150day5days15000.3","FPC",150,"day","5days",99.134,1500,0.3,3.9289372176800001E-2,3.9346649277899999E-2]
["FPC150continuous7days7000.4","FPC",150,"continuous","7days",46.262,700,0.4,4.06887683695E-2,3.8075387526899998E-2]
["FPC150continuous7days11000.4","FPC",150,"continuous","7days",72.697999999999993,1100,0.4,4.2201674617899997E-2,3.94527400108E-2]
["FPC150continuous5days11000.3","FPC",150,"continuous","5days",72.697999999999993,1100,0.3,4.2787858795699997E-2,4.0158345077600001E-2]
["FPC150continuous7days3000.3","FPC",150,"continuous","7days",19.827000000000002,300,0.3,4.2791615099700003E-2,4.02151196727E-2]
["FPC150continuous7days15000.4","FPC",150,"continuous","7days",99.134,1500,0.4,4.3405708391399997E-2,4.0509172026400003E-2]
["FPC150continuous5days15000.3","FPC",150,"continuous","5days",99.134,1500,0.3,4.5244155662100001E-2,4.2517918688799998E-2]
["FPC150continuous7days7000.3","FPC",150,"continuous","7days",46.262,700,0.3,4.8082596893799998E-2,4.4979634270399999E-2]
["FPC150continuous7days11000.3","FPC",150,"continuous","7days",72.697999999999993,1100,0.3,4.93093967669E-2,4.60983227E-2]
["FPC150continuous7days15000.3","FPC",150,"continuous","7days",99.134,1500,0.3,5.0332506194400002E-2,4.69833467911E-2]
["FPC150day5days3000.3","FPC",150,"day","5days",19.827000000000002,300,0.3,5.2612891149400001E-2,5.2644908306900003E-2]
["FPC100continuous5days3000.5","FPC",100,"continuous","5days",20.594999999999999,300,0.5,0.10698225620499999,9.7715763350000012E-2]
["FPC100continuous5days3000.4","FPC",100,"continuous","5days",20.594999999999999,300,0.4,0.13702461992699999,0.126025306442]
["FPC100continuous7days3000.5","FPC",100,"continuous","7days",20.594999999999999,300,0.5,0.13848879478100001,0.12675565908899999]
["FPC100continuous5days7000.5","FPC",100,"continuous","5days",48.055999999999997,700,0.5,0.14910038442699999,0.136928783316]
["FPC100continuous7days3000.4","FPC",100,"continuous","7days",20.594999999999999,300,0.4,0.16550864879900001,0.151170693824]
["FPC100continuous5days7000.4","FPC",100,"continuous","5days",48.055999999999997,700,0.4,0.18071245344299999,0.16544196332399999]
["FPC100continuous5days3000.3","FPC",100,"continuous","5days",20.594999999999999,300,0.3,0.18130787850199998,0.16661497372099998]
["FPC100continuous7days7000.5","FPC",100,"continuous","7days",48.055999999999997,700,0.5,0.18273992241000001,0.167974709202]
["FPC100continuous5days11000.5","FPC",100,"continuous","5days",75.516999999999996,1100,0.5,0.191218512649,0.17614180328199999]
["FPC100day5days3000.5","FPC",100,"day","5days",20.594999999999999,300,0.5,0.19682481561699997,0.18012338615700002]
["FPC100continuous7days3000.3","FPC",100,"continuous","7days",20.594999999999999,300,0.3,0.19779969247599999,0.181555117071]
["FPC100day7days3000.5","FPC",100,"day","7days",20.594999999999999,300,0.5,0.21003884794800001,0.19633011011400001]
["FPC100continuous5days7000.3","FPC",100,"continuous","5days",48.055999999999997,700,0.3,0.21137904179399999,0.19303912993799999]
["FPC100day5days3000.4","FPC",100,"day","5days",20.594999999999999,300,0.4,0.212644940161,0.19368445405100002]
["FPC100day5days3000.3","FPC",100,"day","5days",20.594999999999999,300,0.3,0.21510876612200003,0.19489467751]
["FPC100day5days7000.5","FPC",100,"day","5days",48.055999999999997,700,0.5,0.21561820088799999,0.19691802991900001]
["FPC100continuous7days7000.4","FPC",100,"continuous","7days",48.055999999999997,700,0.4,0.21910923412200001,0.20121711759800001]
["FPC100continuous7days11000.5","FPC",100,"continuous","7days",75.516999999999996,1100,0.5,0.221080234175,0.20448737489499999]
["FPC100continuous5days15000.5","FPC",100,"continuous","5days",102.977,1500,0.5,0.223295196877,0.20534045131000001]
["FPC100continuous5days11000.4","FPC",100,"continuous","5days",75.516999999999996,1100,0.4,0.22440028695899999,0.20485862020599999]
["FPC50continuous5days3000.5","FPC",50,"continuous","5days",21.535,300,0.5,0.22603636128900001,0.20142776160299999]
["FPC100day5days7000.4","FPC",100,"day","5days",48.055999999999997,700,0.4,0.227604144728,0.20696261530000001]
["FPC100day5days7000.3","FPC",100,"day","5days",48.055999999999997,700,0.3,0.22824390091300001,0.20675299286900001]
["FPC100day5days11000.5","FPC",100,"day","5days",75.516999999999996,1100,0.5,0.23441158615900001,0.213712673681]
["FPC100day5days11000.3","FPC",100,"day","5days",75.516999999999996,1100,0.3,0.24137903570399999,0.21861130822800001]
["FPC100continuous5days11000.3","FPC",100,"continuous","5days",75.516999999999996,1100,0.3,0.24145020508600001,0.21946328615499999]
["FPC100day5days11000.4","FPC",100,"day","5days",75.516999999999996,1100,0.4,0.24256334929500001,0.22024077654900001]
["FPC100day5days15000.5","FPC",100,"day","5days",102.977,1500,0.5,0.24672200520900001,0.224683468631]
["FPC100continuous5days15000.4","FPC",100,"continuous","5days",102.977,1500,0.4,0.249375704241,0.22668837133799999]
["FPC100continuous7days15000.5","FPC",100,"continuous","7days",102.977,1500,0.5,0.24989460978899999,0.23132403343300001]
["FPC100day5days15000.3","FPC",100,"day","5days",102.977,1500,0.3,0.252184260943,0.228391328427]
["FPC100day5days15000.4","FPC",100,"day","5days",102.977,1500,0.4,0.25403651809099997,0.23039302337000001]
[{"$f":"B322&C322&D322&E322&G322&H322","v":"FPC100day7days3000.4"},"FPC",100,"day","7days",20.594999999999999,300,0.4,0.254665283942,0.234425256266]
["FPC100continuous5days15000.3","FPC",100,"continuous","5days",102.977,1500,0.3,0.25638574125399999,0.23261545162399999]
["FPC100continuous7days7000.3","FPC",100,"continuous","7days",48.055999999999997,700,0.3,0.25787043072600002,0.236813705519]
["FPC100continuous7days11000.4","FPC",100,"continuous","7days",75.516999999999996,1100,0.4,0.26016877107300002,0.23913045680799999]
["FPC100day7days7000.5","FPC",100,"day","7days",48.055999999999997,700,0.5,0.27661085103100003,0.25366404165200002]
["FPC100day7days3000.3","FPC",100,"day","7days",20.594999999999999,300,0.3,0.28147650676699998,0.25713178044700002]
["FPC100continuous7days15000.4","FPC",100,"continuous","7days",102.977,1500,0.4,0.28666675219100002,0.263085817216]
["FPC100continuous7days11000.3","FPC",100,"continuous","7days",75.516999999999996,1100,0.3,0.29144367937400001,0.26630050380699999]
["FPC100day7days11000.5","FPC",100,"day","7days",75.516999999999996,1100,0.5,0.29175651267500002,0.26698611134]
["FPC100day7days7000.4","FPC",100,"day","7days",48.055999999999997,700,0.4,0.292971578033,0.26761871889400002]
["FPC100day7days7000.3","FPC",100,"day","7days",48.055999999999997,700,0.3,0.29639161977,0.269328054313]
["FPC100day7days15000.5","FPC",100,"day","7days",102.977,1500,0.5,0.29740228651900003,0.27173698920599998]
["FPC50continuous5days3000.4","FPC",50,"continuous","5days",21.535,300,0.4,0.299594550811,0.27030153628600001]
["FPC50continuous7days3000.5","FPC",50,"continuous","7days",21.535,300,0.5,0.30028497598800002,0.267646179747]
["FPC100day7days11000.3","FPC",100,"day","7days",75.516999999999996,1100,0.3,0.30207701614799998,0.27455403532400002]
["FPC100day7days11000.4","FPC",100,"day","7days",75.516999999999996,1100,0.4,0.30285913365099998,0.276347479801]
["FPC100day7days15000.3","FPC",100,"day","7days",102.977,1500,0.3,0.304745296502,0.27708759648100001]
["FPC100day7days15000.4","FPC",100,"day","7days",102.977,1500,0.4,0.30573515996099998,0.27877095490499998]
["FPC100continuous7days15000.3","FPC",100,"continuous","7days",102.977,1500,0.3,0.30596946054099999,0.27874369575000002]
["FPC50continuous5days7000.5","FPC",50,"continuous","5days",50.247999999999998,700,0.5,0.34273952606300001,0.30798402818800003]
["FPC50day5days3000.3","FPC",50,"day","5days",21.535,300,0.3,0.37818248455699993,0.33792005833200001]
["FPC50continuous7days3000.4","FPC",50,"continuous","7days",21.535,300,0.4,0.39048453820000001,0.35280673659299999]
["FPC50day5days3000.4","FPC",50,"day","5days",21.535,300,0.4,0.40104698030800001,0.35812810312199994]
["FPC50day5days7000.3","FPC",50,"day","5days",50.247999999999998,700,0.3,0.40359625292899998,0.36068948736799999]
["FPC50continuous5days3000.3","FPC",50,"continuous","5days",21.535,300,0.3,0.40439491153599999,0.36497764188499998]
["FPC50continuous5days7000.4","FPC",50,"continuous","5days",50.247999999999998,700,0.4,0.40632738341699998,0.36511389517999998]
["FPC50day5days3000.5","FPC",50,"day","5days",21.535,300,0.5,0.41938843663700004,0.37495026003600007]
["FPC50day5days7000.4","FPC",50,"day","5days",50.247999999999998,700,0.4,0.42125942201400002,0.37627420511999998]
["FPC50continuous7days7000.5","FPC",50,"continuous","7days",50.247999999999998,700,0.5,0.42394915024399998,0.38128399380200001]
["FPC50continuous5days11000.5","FPC",50,"continuous","5days",78.962000000000003,1100,0.5,0.42501735561100001,0.38187463656600001]
["FPC50day5days11000.3","FPC",50,"day","5days",78.962000000000003,1100,0.3,0.42901002130100002,0.38345891640399998]
["FPC50continuous5days7000.3","FPC",50,"continuous","5days",50.247999999999998,700,0.3,0.43616385042099998,0.39075791285299999]
["FPC50day5days7000.5","FPC",50,"day","5days",50.247999999999998,700,0.5,0.43634164246000001,0.38992537456800003]
["FPC50day5days11000.4","FPC",50,"day","5days",78.962000000000003,1100,0.4,0.44147186372000002,0.39442030711800002]
["FPC50day5days15000.3","FPC",50,"day","5days",107.675,1500,0.3,0.44868021000399999,0.40103498707000002]
["FPC50day5days11000.5","FPC",50,"day","5days",78.962000000000003,1100,0.5,0.45329484828299998,0.40490048909999998]
["FPC50continuous5days11000.4","FPC",50,"continuous","5days",78.962000000000003,1100,0.4,0.45726922030400002,0.409448844586]
["FPC50day5days15000.4","FPC",50,"day","5days",107.675,1500,0.4,0.45785005491199998,0.40910149862200001]
["FPC50continuous5days11000.3","FPC",50,"continuous","5days",78.962000000000003,1100,0.3,0.45894442208699998,0.41042107542]
["FPC50continuous5days15000.5","FPC",50,"continuous","5days",107.675,1500,0.5,0.46019493002400003,0.41288674863000002]
["FPC50day5days15000.5","FPC",50,"day","5days",107.675,1500,0.5,0.46698765030900002,0.41715930474500001]
["FPC50continuous5days15000.3","FPC",50,"continuous","5days",107.675,1500,0.3,0.473562567928,0.42324313965400001]
["FPC50continuous5days15000.4","FPC",50,"continuous","5days",107.675,1500,0.4,0.47856806022300002,0.42791680975399998]
["FPC50continuous7days7000.4","FPC",50,"continuous","7days",50.247999999999998,700,0.4,0.52391863250000004,0.47212817742500002]
["FPC50day7days3000.3","FPC",50,"day","7days",21.535,300,0.3,0.52495454363499994,0.46933963535799994]
["FPC50continuous7days11000.5","FPC",50,"continuous","7days",78.962000000000003,1100,0.5,0.52781863490199998,0.47519409573299998]
["FPC50continuous7days3000.3","FPC",50,"continuous","7days",21.535,300,0.3,0.53752674990799998,0.48516263539100002]
["FPC50day7days7000.3","FPC",50,"day","7days",50.247999999999998,700,0.3,0.54365973638099996,0.48628182658399999]
["FPC50day7days3000.4","FPC",50,"day","7days",21.535,300,0.4,0.55730975206199995,0.4979478515439999]
["FPC50day7days11000.3","FPC",50,"day","7days",78.962000000000003,1100,0.3,0.56236492912699998,0.50322401781000003]
["FPC50day7days7000.4","FPC",50,"day","7days",50.247999999999998,700,0.4,0.56949846894,0.50912044395699996]
["FPC50day7days15000.3","FPC",50,"day","7days",107.675,1500,0.3,0.57358377050099996,0.51335208724000003]
["FPC50continuous7days15000.5","FPC",50,"continuous","7days",107.675,1500,0.5,0.574835055677,0.51669835183199997]
["FPC50day7days3000.5","FPC",50,"day","7days",21.535,300,0.5,0.57953552407900011,0.51911694686999987]
["FPC50day7days11000.4","FPC",50,"day","7days",78.962000000000003,1100,0.4,0.58168718581800005,0.52029303637000002]
["FPC50continuous7days7000.3","FPC",50,"continuous","7days",50.247999999999998,700,0.3,0.58185622117199998,0.52221054871399997]
["FPC50continuous7days11000.4","FPC",50,"continuous","7days",78.962000000000003,1100,0.4,0.58686609608399998,0.52736389476000001]
["FPC50day7days7000.5","FPC",50,"day","7days",50.247999999999998,700,0.5,0.58844763118300003,0.52688007633699996]
["FPC50day7days15000.4","FPC",50,"day","7days",107.675,1500,0.4,0.58883236185900001,0.52682883061800001]
["FPC50day7days11000.5","FPC",50,"day","7days",78.962000000000003,1100,0.5,0.59735973828699995,0.53464320580400004]
["FPC50continuous7days11000.3","FPC",50,"continuous","7days",78.962000000000003,1100,0.3,0.60109414115100002,0.53849135741099996]
["FPC50day7days15000.5","FPC",50,"day","7days",107.675,1500,0.5,0.60180137094999997,0.53863678685399996]
["FPC50continuous7days15000.4","FPC",50,"continuous","7days",107.675,1500,0.4,0.60647541675799999,0.54415013495800002]
["FPC50continuous7days15000.3","FPC",50,"continuous","7days",107.675,1500,0.3,0.60734474305700004,0.54388808941099998]
[{"$f":"B386&C386&D386&E386&G386&H386","v":"LFC200continuous5days3000.5"},"LFC",200,"continuous","5days",19.309999999999999,300,0.5,0.15406431162299999,0.141116789608]
["LFC150continuous5days3000.5","LFC",150,"continuous","5days",19.827000000000002,300,0.5,0.16815776825899997,0.15468562695400001]
["LFC100continuous5days3000.5","LFC",100,"continuous","5days",20.594999999999999,300,0.5,0.17397207503900003,0.15984416829500003]
["LFC50continuous5days3000.5","LFC",50,"continuous","5days",21.535,300,0.5,0.17648369857000001,0.16204201112800004]
["LFC200continuous5days3000.4","LFC",200,"continuous","5days",19.309999999999999,300,0.4,0.185548352832,0.17032264345199999]
["LFC200continuous7days3000.5","LFC",200,"continuous","7days",19.309999999999999,300,0.5,0.20230909197899999,0.18566594722599999]
["LFC150continuous7days3000.5","LFC",150,"continuous","7days",19.827000000000002,300,0.5,0.210393772437,0.192715804327]
["LFC200continuous5days7000.5","LFC",200,"continuous","5days",45.055999999999997,700,0.5,0.213057733621,0.19578985565900001]
["LFC100continuous7days3000.5","LFC",100,"continuous","7days",20.594999999999999,300,0.5,0.21631352153200001,0.197898771217]
["LFC50continuous7days3000.5","LFC",50,"continuous","7days",21.535,300,0.5,0.21909426192100001,0.200352669786]
["LFC150continuous5days7000.5","LFC",150,"continuous","5days",46.262,700,0.5,0.221302145028,0.203002439945]
["LFC100continuous5days3000.4","LFC",100,"continuous","5days",20.594999999999999,300,0.4,0.22362549725299996,0.20595322602999999]
["LFC50continuous5days3000.4","LFC",50,"continuous","5days",21.535,300,0.4,0.226667356687,0.20859819200700003]
["LFC100continuous5days7000.5","LFC",100,"continuous","5days",48.055999999999997,700,0.5,0.22739515555100001,0.20835771991800001]
["LFC50continuous5days7000.5","LFC",50,"continuous","5days",50.247999999999998,700,0.5,0.23003979318000001,0.21065418208100001]
["LFC200continuous5days3000.3","LFC",200,"continuous","5days",19.309999999999999,300,0.3,0.238317326769,0.220426841165]
["LFC200continuous7days3000.4","LFC",200,"continuous","7days",19.309999999999999,300,0.4,0.243042196668,0.22354346617400001]
["LFC200continuous5days7000.4","LFC",200,"continuous","5days",45.055999999999997,700,0.4,0.25324808453199998,0.23212502202800001]
["LFC100continuous7days3000.4","LFC",100,"continuous","7days",20.594999999999999,300,0.4,0.25840174001100003,0.23739650701000001]
["LFC200continuous7days7000.5","LFC",200,"continuous","7days",45.055999999999997,700,0.5,0.26096130104800003,0.24030824890800001]
["LFC50continuous7days3000.4","LFC",50,"continuous","7days",21.535,300,0.4,0.26150624965199998,0.240176166252]
["LFC150continuous5days3000.4","LFC",150,"continuous","5days",19.827000000000002,300,0.4,0.26172157445499999,0.23969685335400001]
["LFC150continuous5days7000.4","LFC",150,"continuous","5days",46.262,700,0.4,0.26172157445499999,0.23969685335400001]
["LFC200continuous5days11000.5","LFC",200,"continuous","5days",70.802999999999997,1100,0.5,0.26509492797099998,0.24319502824799999]
["LFC50day5days3000.5","LFC",50,"day","5days",21.535,300,0.5,0.26572958770299998,0.24391953072899999]
["LFC100continuous5days7000.4","LFC",100,"continuous","5days",48.055999999999997,700,0.4,0.26790447207099999,0.24519512688699999]
["LFC50continuous5days7000.4","LFC",50,"continuous","5days",50.247999999999998,700,0.4,0.27050428811499999,0.247477617531]
["LFC150continuous7days7000.5","LFC",150,"continuous","7days",46.262,700,0.5,0.27127838125600001,0.24941501777]
["LFC200day5days3000.5","LFC",200,"day","5days",19.309999999999999,300,0.5,0.27304770796700001,0.250873954427]
["LFC150continuous5days11000.5","LFC",150,"continuous","5days",72.697999999999993,1100,0.5,0.27444652179700002,0.25131925293599999]
["LFC150continuous7days3000.4","LFC",150,"continuous","7days",19.827000000000002,300,0.4,0.27463148490200007,0.25365743535900004]
["LFC150day5days3000.5","LFC",150,"day","5days",19.827000000000002,300,0.5,0.27485102876700002,0.25215401576399998]
["LFC100continuous5days3000.3","LFC",100,"continuous","5days",20.594999999999999,300,0.3,0.27791866163300005,0.25462708436199999]
["LFC100continuous7days7000.5","LFC",100,"continuous","7days",48.055999999999997,700,0.5,0.278612493244,0.25589076347400003]
["LFC50continuous5days3000.3","LFC",50,"continuous","5days",21.535,300,0.3,0.28041329564599998,0.25682231887599993]
["LFC100day5days3000.5","LFC",100,"day","5days",20.594999999999999,300,0.5,0.28058982519499998,0.25723021131100005]
["LFC100continuous5days11000.5","LFC",100,"continuous","5days",75.516999999999996,1100,0.5,0.28081823606299999,0.25687127154099998]
["LFC50continuous7days7000.5","LFC",50,"continuous","7days",50.247999999999998,700,0.5,0.28196113241300003,0.25885888180599997]
["LFC200day5days3000.3","LFC",200,"day","5days",19.309999999999999,300,0.3,0.28268057319599998,0.25644063765899999]
["LFC50continuous5days11000.5","LFC",50,"continuous","5days",78.962000000000003,1100,0.5,0.28359588779,0.25926635303399997]
["LFC150continuous5days3000.3","LFC",150,"continuous","5days",19.827000000000002,300,0.3,0.28610569119000001,0.26351754267499999]
["LFC200day5days3000.4","LFC",200,"day","5days",19.309999999999999,300,0.4,0.28612873878599993,0.26048458679899994]
["LFC200day5days7000.5","LFC",200,"day","5days",45.055999999999997,700,0.5,0.28738452885799998,0.262919594019]
["LFC150day5days3000.3","LFC",150,"day","5days",19.827000000000002,300,0.3,0.28956178674299998,0.26250176222799992]
["LFC200continuous5days7000.3","LFC",200,"continuous","5days",45.055999999999997,700,0.3,0.28994400979899998,0.26493812836899999]
["LFC50day5days3000.3","LFC",50,"day","5days",21.535,300,0.3,0.29177461492100004,0.26399648200700004]
["LFC100day5days3000.3","LFC",100,"day","5days",20.594999999999999,300,0.3,0.29325440569999994,0.26564336672099997]
["LFC150day5days3000.4","LFC",150,"day","5days",19.827000000000002,300,0.4,0.29330946058100005,0.26686097705]
["LFC50day5days3000.4","LFC",50,"day","5days",21.535,300,0.4,0.29342689384499998,0.267672513916]
["LFC200continuous5days15000.5","LFC",200,"continuous","5days",96.549000000000007,1500,0.5,0.29573140699400002,0.270530618655]
["LFC150day5days7000.5","LFC",150,"day","5days",46.262,700,0.5,0.29628008746500001,0.27078670916699998]
["LFC200continuous5days11000.4","LFC",200,"continuous","5days",70.802999999999997,1100,0.4,0.29802152140299998,0.27175037200500002]
["LFC200day5days7000.3","LFC",200,"day","5days",45.055999999999997,700,0.3,0.298056503714,0.270360275471]
["LFC150continuous5days7000.3","LFC",150,"continuous","5days",46.262,700,0.3,0.29834784762099997,0.27237132706799999]
["LFC200day5days7000.4","LFC",200,"day","5days",45.055999999999997,700,0.4,0.30152279040199997,0.27417620717199997]
["LFC100day5days7000.5","LFC",100,"day","5days",48.055999999999997,700,0.5,0.30192527801399999,0.27571986571200002]
["LFC50day5days7000.5","LFC",50,"day","5days",50.247999999999998,700,0.5,0.30333248606500002,0.27684449760199997]
["LFC100continuous5days7000.3","LFC",100,"continuous","5days",48.055999999999997,700,0.3,0.30393457601700002,0.27728389027]
["LFC150day5days7000.3","LFC",150,"day","5days",46.262,700,0.3,0.30518294618399999,0.27666514197499997]
["LFC150continuous5days15000.5","LFC",150,"continuous","5days",99.134,1500,0.5,0.30590079375399998,0.27930392576800001]
["LFC50continuous5days7000.3","LFC",50,"continuous","5days",50.247999999999998,700,0.3,0.30592684113599999,0.27898153030099998]
["LFC150continuous5days11000.4","LFC",150,"continuous","5days",72.697999999999993,1100,0.4,0.306431210959,0.27930208926200001]
["LFC50day5days7000.3","LFC",50,"day","5days",50.247999999999998,700,0.3,0.30774986916000002,0.27855273979900003]
["LFC200day5days11000.5","LFC",200,"day","5days",70.802999999999997,1100,0.5,0.30875891933900002,0.28159060998399998]
[{"$f":"B450&C450&D450&E450&G450&H450","v":"LFC150day5days7000.4"},"LFC",150,"day","5days",46.262,700,0.4,0.30880497544000002,0.28063980811]
["LFC100day5days7000.3","LFC",100,"day","5days",48.055999999999997,700,0.3,0.30891090331499999,0.279874268973]
["LFC200continuous7days3000.3","LFC",200,"continuous","7days",19.309999999999999,300,0.3,0.30907810694299998,0.28631931405200001]
["LFC200continuous7days11000.5","LFC",200,"continuous","7days",70.802999999999997,1100,0.5,0.31042163155000002,0.28625495409599999]
["LFC200continuous7days7000.4","LFC",200,"continuous","7days",45.055999999999997,700,0.4,0.31067249061300001,0.28597643943000001]
["LFC100continuous5days11000.4","LFC",100,"continuous","5days",75.516999999999996,1100,0.4,0.31218344688900002,0.28443702774399998]
["LFC100continuous5days15000.5","LFC",100,"continuous","5days",102.977,1500,0.5,0.31253422224799998,0.285050074687]
["LFC100day5days3000.4","LFC",100,"day","5days",20.594999999999999,300,0.4,0.31308162060400002,0.28435520632099998]
["LFC100day5days7000.4","LFC",100,"day","5days",48.055999999999997,700,0.4,0.31308162060400002,0.28435520632099998]
["LFC200day5days11000.3","LFC",200,"day","5days",70.802999999999997,1100,0.3,0.31343243423200001,0.28427991328300001]
["LFC50day5days7000.4","LFC",50,"day","5days",50.247999999999998,700,0.4,0.31348717952799998,0.28454346632100003]
["LFC50continuous5days11000.4","LFC",50,"continuous","5days",78.962000000000003,1100,0.4,0.31434121954299998,0.28635704305499998]
["LFC50continuous5days15000.5","LFC",50,"continuous","5days",107.675,1500,0.5,0.31499793553,0.287175128926]
["LFC200continuous5days11000.3","LFC",200,"continuous","5days",70.802999999999997,1100,0.3,0.316609934358,0.28819204098500001]
["LFC200day5days11000.4","LFC",200,"day","5days",70.802999999999997,1100,0.4,0.31691684201800002,0.28786782754500001]
["LFC150day5days11000.5","LFC",150,"day","5days",72.697999999999993,1100,0.5,0.317709146163,0.28941940256999998]
["LFC150continuous7days3000.3","LFC",150,"continuous","7days",19.827000000000002,300,0.3,0.32055664045100002,0.29681613433699999]
["LFC150day5days11000.3","LFC",150,"day","5days",72.697999999999993,1100,0.3,0.320804105625,0.29082852172200002]
["LFC200continuous5days15000.4","LFC",200,"continuous","5days",96.549000000000007,1500,0.4,0.32205453829800001,0.29328991231200002]
["LFC150continuous7days7000.4","LFC",150,"continuous","7days",46.262,700,0.4,0.32212056473900003,0.29628812774500002]
["LFC150continuous7days11000.5","LFC",150,"continuous","7days",72.697999999999993,1100,0.5,0.32280268408700002,0.297193622421]
["LFC100day5days11000.5","LFC",100,"day","5days",75.516999999999996,1100,0.5,0.323260730833,0.294209520113]
["LFC50day5days11000.3","LFC",50,"day","5days",78.962000000000003,1100,0.3,0.323725123399,0.29310899759100001]
["LFC200day5days15000.5","LFC",200,"day","5days",96.549000000000007,1500,0.5,0.324091368085,0.294914282571]
["LFC50day5days11000.5","LFC",50,"day","5days",78.962000000000003,1100,0.5,0.32416497480500001,0.294833494616]
["LFC150day5days11000.4","LFC",150,"day","5days",72.697999999999993,1100,0.4,0.32430049029899999,0.29441863917]
["LFC100day5days11000.3","LFC",100,"day","5days",75.516999999999996,1100,0.3,0.32456740093000003,0.29410517122500002]
["LFC150continuous5days11000.3","LFC",150,"continuous","5days",72.697999999999993,1100,0.3,0.32480458008500002,0.295446317041]
["LFC200day5days15000.3","LFC",200,"day","5days",96.549000000000007,1500,0.3,0.32620648428999999,0.29585465575499997]
["LFC50day5days11000.4","LFC",50,"day","5days",78.962000000000003,1100,0.4,0.32850471764,0.29788923663900002]
["LFC100continuous7days3000.3","LFC",100,"continuous","7days",20.594999999999999,300,0.3,0.32857521037600002,0.30407811146800001]
["LFC100day5days11000.4","LFC",100,"day","5days",75.516999999999996,1100,0.4,0.32857713546299999,0.29813403738100003]
["LFC200day5days15000.4","LFC",200,"day","5days",96.549000000000007,1500,0.4,0.328930478262,0.29858091698700001]
["LFC100continuous5days11000.3","LFC",100,"continuous","5days",75.516999999999996,1100,0.3,0.329950490401,0.29994069617800001]
["LFC100continuous7days7000.4","LFC",100,"continuous","7days",48.055999999999997,700,0.4,0.33034328646,0.30366881752199998]
["LFC150continuous5days15000.4","LFC",150,"continuous","5days",99.134,1500,0.4,0.33060818798000002,0.30094323766199998]
["LFC100continuous7days11000.5","LFC",100,"continuous","7days",75.516999999999996,1100,0.5,0.33119291897199998,0.30462234060600002]
["LFC50continuous5days11000.3","LFC",50,"continuous","5days",78.962000000000003,1100,0.3,0.33144038662600001,0.30114074172600003]
["LFC50continuous7days3000.3","LFC",50,"continuous","7days",21.535,300,0.3,0.33223925060499998,0.307372796803]
["LFC200continuous5days15000.3","LFC",200,"continuous","5days",96.549000000000007,1500,0.3,0.332934792742,0.30262068697]
["LFC150day5days15000.5","LFC",150,"day","5days",99.134,1500,0.5,0.33319959634000001,0.30290929112999998]
["LFC150day5days15000.3","LFC",150,"day","5days",99.134,1500,0.3,0.33353392928300002,0.30239235557900002]
["LFC50continuous7days7000.4","LFC",50,"continuous","7days",50.247999999999998,700,0.4,0.33395241454800001,0.30688677489799998]
["LFC50continuous7days11000.5","LFC",50,"continuous","7days",78.962000000000003,1100,0.5,0.334932567683,0.30788316313899999]
["LFC100continuous5days15000.4","LFC",100,"continuous","5days",102.977,1500,0.4,0.33587640367400001,0.305645495845]
["LFC150day5days15000.4","LFC",150,"day","5days",99.134,1500,0.4,0.33648247881600002,0.30529787044599999]
["LFC50day5days15000.3","LFC",50,"day","5days",107.675,1500,0.3,0.33666752572899999,0.304849881898]
["LFC100day5days15000.3","LFC",100,"day","5days",102.977,1500,0.3,0.33762755736299999,0.30593857775099997]
["LFC50continuous5days15000.4","LFC",50,"continuous","5days",107.675,1500,0.4,0.33803417632799998,0.307565511156]
["LFC100day5days15000.5","LFC",100,"day","5days",102.977,1500,0.5,0.33875549498099999,0.30770251702000001]
["LFC50day5days15000.5","LFC",50,"day","5days",107.675,1500,0.5,0.33936268655099999,0.30806483870500001]
["LFC50day5days15000.4","LFC",50,"day","5days",107.675,1500,0.4,0.34100237412000001,0.309035006379]
["LFC100day5days15000.4","LFC",100,"day","5days",102.977,1500,0.4,0.34109005194000003,0.30928590423000002]
["LFC150continuous5days15000.3","LFC",150,"continuous","5days",99.134,1500,0.3,0.34111908762799997,0.30987503716600001]
["LFC100continuous5days15000.3","LFC",100,"continuous","5days",102.977,1500,0.3,0.34627325604699999,0.31437157404799998]
["LFC50continuous5days15000.3","LFC",50,"continuous","5days",107.675,1500,0.3,0.34721655697800002,0.31506311649800001]
["LFC150day7days3000.5","LFC",150,"day","7days",19.827000000000002,300,0.5,0.34757037929500001,0.32086090384799998]
["LFC200continuous7days15000.5","LFC",200,"continuous","7days",96.549000000000007,1500,0.5,0.34802998849400002,0.32082853948500001]
["LFC200continuous7days11000.4","LFC",200,"continuous","7days",70.802999999999997,1100,0.4,0.35754418485299999,0.32818781980599998]
["LFC50day7days3000.5","LFC",50,"day","7days",21.535,300,0.5,0.359476299823,0.33131027798500001]
["LFC150continuous7days15000.5","LFC",150,"continuous","7days",99.134,1500,0.5,0.36082291568800001,0.33200550130899997]
["LFC200continuous7days7000.3","LFC",200,"continuous","7days",45.055999999999997,700,0.3,0.366795686126,0.33698168979900001]
["LFC100continuous7days15000.5","LFC",100,"continuous","7days",102.977,1500,0.5,0.36917973636500001,0.33930828504499999]
["LFC150continuous7days11000.4","LFC",150,"continuous","7days",72.697999999999993,1100,0.4,0.36960964457599998,0.338918820131]
[{"$f":"B514&C514&D514&E514&G514&H514","v":"LFC50continuous7days15000.5"},"LFC",50,"continuous","7days",107.675,1500,0.5,0.372456668326,0.34214214394499998]
["LFC200day7days3000.5","LFC",200,"day","7days",19.309999999999999,300,0.5,0.37246120435800001,0.34344265577700001]
["LFC200day7days7000.5","LFC",200,"day","7days",45.055999999999997,700,0.5,0.37675172319799999,0.34622228684799999]
["LFC100day7days3000.5","LFC",100,"day","7days",20.594999999999999,300,0.5,0.37713069242399999,0.34884242418599998]
["LFC100continuous7days11000.4","LFC",100,"continuous","7days",75.516999999999996,1100,0.4,0.37782868245000001,0.34623762992700002]
["LFC150continuous7days7000.3","LFC",150,"continuous","7days",46.262,700,0.3,0.37905318499500001,0.34794326686999999]
["LFC50continuous7days11000.4","LFC",50,"continuous","7days",78.962000000000003,1100,0.4,0.38113826466,0.34913818031299998]
["LFC200continuous7days15000.4","LFC",200,"continuous","7days",96.549000000000007,1500,0.4,0.38623261713399998,0.35343006519199999]
["LFC100continuous7days7000.3","LFC",100,"continuous","7days",48.055999999999997,700,0.3,0.38749564409800002,0.35544788199600003]
["LFC200day7days3000.3","LFC",200,"day","7days",19.309999999999999,300,0.3,0.388228111993,0.35310452748500004]
["LFC150day7days7000.5","LFC",150,"day","7days",46.262,700,0.5,0.38874969870699999,0.35687129312299998]
["LFC200day7days3000.4","LFC",200,"day","7days",19.309999999999999,300,0.4,0.38911335945699999,0.35645789326999999]
["LFC150day7days3000.4","LFC",150,"day","7days",19.827000000000002,300,0.4,0.38949494274399998,0.35667435197699998]
["LFC50continuous7days7000.3","LFC",50,"continuous","7days",50.247999999999998,700,0.3,0.39065190206799999,0.35818658165700001]
["LFC200day7days11000.5","LFC",200,"day","7days",70.802999999999997,1100,0.5,0.39298661394000001,0.360178528113]
["LFC200continuous7days11000.3","LFC",200,"continuous","7days",70.802999999999997,1100,0.3,0.39458102054400002,0.361035103292]
["LFC200day7days7000.3","LFC",200,"day","7days",45.055999999999997,700,0.3,0.39605005268999999,0.36030367760600002]
["LFC100day7days7000.5","LFC",100,"day","7days",48.055999999999997,700,0.5,0.39654834793900001,0.36372135663299998]
["LFC150day7days3000.3","LFC",150,"day","7days",19.827000000000002,300,0.3,0.39839060237099994,0.36205654641000001]
["LFC150continuous7days15000.4","LFC",150,"continuous","7days",99.134,1500,0.4,0.39856410505599998,0.36435830417600001]
["LFC50day7days7000.5","LFC",50,"day","7days",50.247999999999998,700,0.5,0.39861568239200001,0.365394748459]
["LFC200day7days15000.5","LFC",200,"day","7days",96.549000000000007,1500,0.5,0.40044561758300001,0.36645906068099998]
["LFC50day7days3000.4","LFC",50,"day","7days",21.535,300,0.4,0.40047938321299997,0.36633562613800003]
["LFC200day7days7000.4","LFC",200,"day","7days",45.055999999999997,700,0.4,0.40106484291,0.36578690158600002]
["LFC50day7days3000.3","LFC",50,"day","7days",21.535,300,0.3,0.40233503135799997,0.36494008507699999]
["LFC100day7days3000.3","LFC",100,"day","7days",20.594999999999999,300,0.3,0.40374094317400006,0.36661734380399996]
["LFC200day7days11000.3","LFC",200,"day","7days",70.802999999999997,1100,0.3,0.40387199338699997,0.36750282772699999]
["LFC150day7days11000.5","LFC",150,"day","7days",72.697999999999993,1100,0.5,0.404690820156,0.37056977549199999]
["LFC150continuous7days11000.3","LFC",150,"continuous","7days",72.697999999999993,1100,0.3,0.40598667945400002,0.371216459276]
["LFC150day7days7000.3","LFC",150,"day","7days",46.262,700,0.3,0.40623262124499998,0.369317121927]
["LFC100continuous7days15000.4","LFC",100,"continuous","7days",102.977,1500,0.4,0.40644308943899998,0.37134884380900002]
["LFC200continuous7days15000.3","LFC",200,"continuous","7days",96.549000000000007,1500,0.3,0.40805331597099997,0.37269601581099998]
["LFC200day7days15000.3","LFC",200,"day","7days",96.549000000000007,1500,0.3,0.408089743472,0.37142555514100001]
["LFC50continuous7days15000.4","LFC",50,"continuous","7days",107.675,1500,0.4,0.40945830717100001,0.37398857239599997]
["LFC100day7days3000.4","LFC",100,"day","7days",20.594999999999999,300,0.4,0.40984572088900006,0.373512944821]
["LFC200day7days11000.4","LFC",200,"day","7days",70.802999999999997,1100,0.4,0.40996669279699999,0.373547414789]
["LFC50day7days7000.3","LFC",50,"day","7days",50.247999999999998,700,0.3,0.41045098527099999,0.37251204461499998]
["LFC100day7days7000.3","LFC",100,"day","7days",48.055999999999997,700,0.3,0.41165648975000002,0.37395953292599998]
["LFC150day7days7000.4","LFC",150,"day","7days",46.262,700,0.4,0.411825489085,0.37526418922499999]
["LFC100day7days11000.5","LFC",100,"day","7days",75.516999999999996,1100,0.5,0.41208414629599999,0.37701211297800002]
["LFC150day7days15000.5","LFC",150,"day","7days",99.134,1500,0.5,0.41228283789800002,0.37694892739000002]
["LFC50day7days11000.5","LFC",50,"day","7days",78.962000000000003,1100,0.5,0.41339078151300002,0.37792793196500002]
["LFC100continuous7days11000.3","LFC",100,"continuous","7days",75.516999999999996,1100,0.3,0.41344447894399999,0.37778731083099998]
["LFC200day7days15000.4","LFC",200,"day","7days",96.549000000000007,1500,0.4,0.413661751887,0.37679607180199998]
["LFC150day7days11000.3","LFC",150,"day","7days",72.697999999999993,1100,0.3,0.41407464011900003,0.37657769744399999]
["LFC50continuous7days11000.3","LFC",50,"continuous","7days",78.962000000000003,1100,0.3,0.41618015382500001,0.38011218735899999]
["LFC100day7days7000.4","LFC",100,"day","7days",48.055999999999997,700,0.4,0.41792197704900003,0.38062302781000001]
["LFC150day7days15000.3","LFC",150,"day","7days",99.134,1500,0.3,0.41826014069200002,0.38049171942999999]
["LFC50day7days7000.4","LFC",50,"day","7days",50.247999999999998,700,0.4,0.41850656202699998,0.38093000446600001]
["LFC50day7days11000.3","LFC",50,"day","7days",78.962000000000003,1100,0.3,0.41856693918400001,0.38008400415299998]
["LFC150continuous7days15000.3","LFC",150,"continuous","7days",99.134,1500,0.3,0.41915942900199998,0.38255996480400001]
["LFC100day7days15000.5","LFC",100,"day","7days",102.977,1500,0.5,0.41946299018099997,0.383211151523]
["LFC100day7days11000.3","LFC",100,"day","7days",75.516999999999996,1100,0.3,0.41957203632599999,0.381301722048]
["LFC150day7days11000.4","LFC",150,"day","7days",72.697999999999993,1100,0.4,0.42023354063399998,0.38270038463299999]
["LFC50day7days15000.5","LFC",50,"day","7days",107.675,1500,0.5,0.42055704672599997,0.38394992006099998]
["LFC50day7days15000.3","LFC",50,"day","7days",107.675,1500,0.3,0.42307388430600001,0.38432421269799999]
["LFC100day7days15000.3","LFC",100,"day","7days",102.977,1500,0.3,0.423876753617,0.38536480600299999]
["LFC150day7days15000.4","LFC",150,"day","7days",99.134,1500,0.4,0.42401247826900001,0.38603058111100003]
["LFC50day7days11000.4","LFC",50,"day","7days",78.962000000000003,1100,0.4,0.42581386084799999,0.38728035687000001]
["LFC100day7days11000.4","LFC",100,"day","7days",75.516999999999996,1100,0.4,0.42599823320899999,0.38773311079900002]
["LFC100continuous7days15000.3","LFC",100,"continuous","7days",102.977,1500,0.3,0.42625697090800002,0.388852112375]
["LFC50continuous7days15000.3","LFC",50,"continuous","7days",107.675,1500,0.3,0.42831244121099998,0.39056680357200002]
["LFC50day7days15000.4","LFC",50,"day","7days",107.675,1500,0.4,0.4296892491,0.39069735890399998]
["LFC100day7days15000.4","LFC",100,"day","7days",102.977,1500,0.4,0.429905870972,0.39115881826100002]
[{"$f":"B578&C578&D578&E578&G578&H578","v":"PTC200continuous5days3000.5"},"PTC",200,"continuous","5days",19.309999999999999,300,0.5,0.15091319026900002,0.14056725892599997]
["PTC150continuous5days3000.5","PTC",150,"continuous","5days",19.827000000000002,300,0.5,0.163671138676,0.15087949324700001]
["PTC200continuous7days3000.5","PTC",200,"continuous","7days",19.309999999999999,300,0.5,0.18898725575600001,0.17549260418199999]
["PTC100continuous5days3000.5","PTC",100,"continuous","5days",20.594999999999999,300,0.5,0.19541205233900005,0.18147130648999998]
["PTC200continuous5days7000.5","PTC",200,"continuous","5days",45.055999999999997,700,0.5,0.202283034493,0.18794086005499999]
["PTC200continuous5days3000.4","PTC",200,"continuous","5days",19.309999999999999,300,0.4,0.20254598286500003,0.18917424646699998]
["PTC50continuous5days3000.5","PTC",50,"continuous","5days",21.535,300,0.5,0.20257337137699999,0.185614668594]
["PTC150continuous5days3000.4","PTC",150,"continuous","5days",19.827000000000002,300,0.4,0.204995533121,0.19037231208399999]
["PTC150continuous7days3000.5","PTC",150,"continuous","7days",19.827000000000002,300,0.5,0.21428481834400001,0.197994354171]
["PTC150continuous5days7000.5","PTC",150,"continuous","5days",46.262,700,0.5,0.23169836288699999,0.21438898069099999]
["PTC200continuous7days3000.4","PTC",200,"continuous","7days",19.309999999999999,300,0.4,0.23627174680900001,0.22008209708500001]
["PTC100continuous7days3000.5","PTC",100,"continuous","7days",20.594999999999999,300,0.5,0.23878988638099999,0.219681925759]
["PTC200continuous7days7000.5","PTC",200,"continuous","7days",45.055999999999997,700,0.5,0.24821636002700001,0.23107133403899999]
["PTC200continuous5days7000.4","PTC",200,"continuous","5days",45.055999999999997,700,0.4,0.24837649055300001,0.229975358716]
["PTC200continuous5days11000.5","PTC",200,"continuous","5days",70.802999999999997,1100,0.5,0.25365287871699999,0.23531446118400001]
["PTC100continuous5days7000.5","PTC",100,"continuous","5days",48.055999999999997,700,0.5,0.25988631087500003,0.239892570365]
["PTC50continuous7days3000.5","PTC",50,"continuous","7days",21.535,300,0.5,0.26471039553800002,0.242715144025]
["PTC50continuous5days3000.4","PTC",50,"continuous","5days",21.535,300,0.4,0.26508507723500002,0.24637113906399999]
["PTC200day5days3000.5","PTC",200,"day","5days",19.309999999999999,300,0.5,0.26597968869900002,0.24724272865399999]
["PTC100continuous5days3000.4","PTC",100,"continuous","5days",20.594999999999999,300,0.4,0.26767512265300003,0.24899945139799995]
["PTC150continuous7days3000.4","PTC",150,"continuous","7days",19.827000000000002,300,0.4,0.26963245770400002,0.25129273213499997]
["PTC200continuous5days3000.3","PTC",200,"continuous","5days",19.309999999999999,300,0.3,0.27829074438599999,0.262919753654]
["PTC200day5days7000.5","PTC",200,"day","5days",45.055999999999997,700,0.5,0.283044461591,0.26166264624000002]
["PTC150continuous7days7000.5","PTC",150,"continuous","7days",46.262,700,0.5,0.28411765231800001,0.26368347287600002]
["PTC150continuous5days3000.3","PTC",150,"continuous","5days",19.827000000000002,300,0.3,0.28423938520399999,0.266233479153]
["PTC150continuous5days7000.4","PTC",150,"continuous","5days",46.262,700,0.4,0.28432114000199998,0.262722423363]
["PTC200continuous5days15000.5","PTC",200,"continuous","5days",96.549000000000007,1500,0.5,0.28477480382600001,0.26361079549400002]
["PTC200day5days3000.3","PTC",200,"day","5days",19.309999999999999,300,0.3,0.28557413476799998,0.26094306623599994]
["PTC200day5days3000.4","PTC",200,"day","5days",19.309999999999999,300,0.4,0.28615529664700007,0.26255508737700001]
["PTC50continuous5days7000.5","PTC",50,"continuous","5days",50.247999999999998,700,0.5,0.28807771461300002,0.265234961996]
["PTC150continuous5days11000.5","PTC",150,"continuous","5days",72.697999999999993,1100,0.5,0.29053705087199999,0.26816562569699998]
["PTC200continuous5days7000.3","PTC",200,"continuous","5days",45.055999999999997,700,0.3,0.29068067792300001,0.26781394790599999]
["PTC200continuous5days11000.4","PTC",200,"continuous","5days",70.802999999999997,1100,0.4,0.294206998241,0.27077647096500002]
["PTC200continuous7days11000.5","PTC",200,"continuous","7days",70.802999999999997,1100,0.5,0.29711640611700002,0.27696670401000001]
["PTC150day5days3000.5","PTC",150,"day","5days",19.827000000000002,300,0.5,0.29960745977699998,0.27716599221899996]
["PTC200day5days7000.3","PTC",200,"day","5days",45.055999999999997,700,0.3,0.30118789157699999,0.27504452056099998]
["PTC200day5days7000.4","PTC",200,"day","5days",45.055999999999997,700,0.4,0.30218386382700002,0.27678944471700001]
["PTC200continuous7days7000.4","PTC",200,"continuous","7days",45.055999999999997,700,0.4,0.30251411800400002,0.28136701284900001]
["PTC100continuous7days3000.4","PTC",100,"continuous","7days",20.594999999999999,300,0.4,0.30467603943900001,0.28413089756400001]
["PTC200day5days11000.5","PTC",200,"day","5days",70.802999999999997,1100,0.5,0.30543382269399999,0.28110273493400001]
["PTC200continuous7days3000.3","PTC",200,"continuous","7days",19.309999999999999,300,0.3,0.30936768945900001,0.28934384090699999]
["PTC200day5days11000.3","PTC",200,"day","5days",70.802999999999997,1100,0.3,0.316801648386,0.28914597488600002]
["PTC100continuous5days7000.4","PTC",100,"continuous","5days",48.055999999999997,700,0.4,0.31713520229100001,0.29245611973699998]
["PTC200continuous5days11000.3","PTC",200,"continuous","5days",70.802999999999997,1100,0.3,0.31741810339799997,0.29108921074299998]
["PTC200day5days11000.4","PTC",200,"day","5days",70.802999999999997,1100,0.4,0.31821243100699997,0.29102380205700001]
["PTC100continuous7days7000.5","PTC",100,"continuous","7days",48.055999999999997,700,0.5,0.31849276763200002,0.29491569635100001]
["PTC200continuous5days15000.4","PTC",200,"continuous","5days",96.549000000000007,1500,0.4,0.32056674849599998,0.29417864012799999]
["PTC150day5days3000.4","PTC",150,"day","5days",19.827000000000002,300,0.4,0.32099231194599998,0.29381332817000005]
["PTC200day5days15000.5","PTC",200,"day","5days",96.549000000000007,1500,0.5,0.321288214302,0.294933207458]
["PTC200day7days3000.5","PTC",200,"day","7days",19.309999999999999,300,0.5,0.32178879946599998,0.30197070438099999]
["PTC150day5days3000.3","PTC",150,"day","5days",19.827000000000002,300,0.3,0.32281794838399996,0.29443336818400001]
["PTC150day5days7000.5","PTC",150,"day","5days",46.262,700,0.5,0.323795132027,0.29809282365899997]
["PTC100continuous5days11000.5","PTC",100,"continuous","5days",75.516999999999996,1100,0.5,0.324360569411,0.29831383424000002]
["PTC100day5days3000.5","PTC",100,"day","5days",20.594999999999999,300,0.5,0.32606578456899998,0.302162799368]
["PTC150continuous5days15000.5","PTC",150,"continuous","5days",99.134,1500,0.5,0.32793418746000003,0.30169322353299999]
["PTC200day5days15000.3","PTC",200,"day","5days",96.549000000000007,1500,0.3,0.32881427492300003,0.300094460161]
["PTC150continuous5days7000.3","PTC",150,"continuous","5days",46.262,700,0.3,0.32943936449700001,0.30284494987100002]
["PTC200day5days15000.4","PTC",200,"day","5days",96.549000000000007,1500,0.4,0.33010237974899997,0.301641785647]
["PTC150continuous5days11000.4","PTC",150,"continuous","5days",72.697999999999993,1100,0.4,0.33226717518999999,0.305029562935]
["PTC200continuous5days15000.3","PTC",200,"continuous","5days",96.549000000000007,1500,0.3,0.33383174948200001,0.30560556744200001]
["PTC200continuous7days15000.5","PTC",200,"continuous","7days",96.549000000000007,1500,0.5,0.33691701266700003,0.31405845801600002]
["PTC150day5days7000.4","PTC",150,"day","5days",46.262,700,0.4,0.33811038855999997,0.30906678757400002]
["PTC150day5days7000.3","PTC",150,"day","5days",46.262,700,0.3,0.33888533926999997,0.309073323186]
["PTC150continuous7days11000.5","PTC",150,"continuous","7days",72.697999999999993,1100,0.5,0.34313493417300001,0.31856720536700001]
[{"$f":"B642&C642&D642&E642&G642&H642","v":"PTC50continuous7days3000.4"},"PTC",50,"continuous","7days",21.535,300,0.4,0.34499974231800001,0.32177590552099999]
["PTC50continuous5days7000.4","PTC",50,"continuous","5days",50.247999999999998,700,0.4,0.347383739907,0.31934001377100002]
["PTC150day5days11000.5","PTC",150,"day","5days",72.697999999999993,1100,0.5,0.34798280427700001,0.31901965509899999]
["PTC150continuous7days7000.4","PTC",150,"continuous","7days",46.262,700,0.4,0.35045978436300002,0.32574408995999998]
["PTC100day5days3000.4","PTC",100,"day","5days",20.594999999999999,300,0.4,0.35059472207199999,0.32004814197099996]
["PTC100day5days3000.3","PTC",100,"day","5days",20.594999999999999,300,0.3,0.35068161997699998,0.31946158808099995]
["PTC50continuous7days7000.5","PTC",50,"continuous","7days",50.247999999999998,700,0.5,0.351588734229,0.32472449031700001]
["PTC200continuous7days11000.4","PTC",200,"continuous","7days",70.802999999999997,1100,0.4,0.35193414329400002,0.32635690121099997]
["PTC150day5days11000.3","PTC",150,"day","5days",72.697999999999993,1100,0.3,0.35495273015599998,0.323713278188]
["PTC150day5days11000.4","PTC",150,"day","5days",72.697999999999993,1100,0.4,0.35522846517399997,0.32432024697799999]
["PTC50continuous5days11000.5","PTC",50,"continuous","5days",78.962000000000003,1100,0.5,0.35527923751399998,0.32574488349300001]
["PTC100continuous5days3000.3","PTC",100,"continuous","5days",20.594999999999999,300,0.3,0.35601122254500001,0.33045026005299999]
["PTC150continuous5days11000.3","PTC",150,"continuous","5days",72.697999999999993,1100,0.3,0.35728815786700002,0.32702738933999997]
["PTC150continuous5days15000.4","PTC",150,"continuous","5days",99.134,1500,0.4,0.36018157253499999,0.32999324519700002]
["PTC100day5days7000.5","PTC",100,"day","5days",48.055999999999997,700,0.5,0.360742983081,0.33047832930900001]
["PTC150continuous7days3000.3","PTC",150,"continuous","7days",19.827000000000002,300,0.3,0.36075413251400001,0.33748929047199999]
["PTC50day5days3000.3","PTC",50,"day","5days",21.535,300,0.3,0.36166796014999997,0.32820348966300006]
["PTC50continuous5days3000.3","PTC",50,"continuous","5days",21.535,300,0.3,0.36316687585899998,0.33837282623100001]
["PTC150day5days15000.5","PTC",150,"day","5days",99.134,1500,0.5,0.36374398540300001,0.33265463219899999]
["PTC100continuous5days7000.3","PTC",100,"continuous","5days",48.055999999999997,700,0.3,0.365061396792,0.33468739749199999]
["PTC100continuous5days11000.4","PTC",100,"continuous","5days",75.516999999999996,1100,0.4,0.36659528192899998,0.335912788076]
["PTC100continuous5days15000.5","PTC",100,"continuous","5days",102.977,1500,0.5,0.36690606693400002,0.33622439375099999]
["PTC100day5days7000.3","PTC",100,"day","5days",48.055999999999997,700,0.3,0.36775473003699999,0.33492597279699998]
["PTC200continuous7days7000.3","PTC",200,"continuous","7days",45.055999999999997,700,0.3,0.367788209202,0.34106337802199999]
["PTC150day5days15000.3","PTC",150,"day","5days",99.134,1500,0.3,0.36801348177400001,0.33554974761799999]
["PTC150day5days15000.4","PTC",150,"day","5days",99.134,1500,0.4,0.36830987561599998,0.335989396494]
["PTC100day5days7000.4","PTC",100,"day","5days",48.055999999999997,700,0.4,0.36884761872799998,0.33627952813099998]
["PTC200day7days7000.5","PTC",200,"day","7days",45.055999999999997,700,0.5,0.371112455033,0.34494333011400002]
["PTC50day5days3000.4","PTC",50,"day","5days",21.535,300,0.4,0.37113181963500003,0.33702911297900001]
["PTC150continuous5days15000.3","PTC",150,"continuous","5days",99.134,1500,0.3,0.374413071539,0.34193523896799999]
["PTC200day7days3000.4","PTC",200,"day","7days",19.309999999999999,300,0.4,0.38113671736499999,0.35328446604199998]
["PTC50day5days7000.3","PTC",50,"day","5days",50.247999999999998,700,0.3,0.38122997980899997,0.34603741032200003]
["PTC200continuous7days15000.4","PTC",200,"continuous","7days",96.549000000000007,1500,0.4,0.38225584025800002,0.35341786913200002]
["PTC100day5days11000.5","PTC",100,"day","5days",75.516999999999996,1100,0.5,0.38230054147199999,0.34927545581399999]
["PTC150day7days3000.5","PTC",150,"day","7days",19.827000000000002,300,0.5,0.38381236265200003,0.35870847193700001]
["PTC100day5days11000.3","PTC",100,"day","5days",75.516999999999996,1100,0.3,0.384827840097,0.35039035751300002]
["PTC100continuous7days11000.5","PTC",100,"continuous","7days",75.516999999999996,1100,0.5,0.38622589528399998,0.35750367685399997]
["PTC50day5days7000.5","PTC",50,"day","5days",50.247999999999998,700,0.5,0.38654036135199998,0.35269264711199999]
["PTC100day5days11000.4","PTC",100,"day","5days",75.516999999999996,1100,0.4,0.38710051538399998,0.35251091429100001]
["PTC150continuous7days15000.5","PTC",150,"continuous","7days",99.134,1500,0.5,0.38907358756600002,0.36073423280099998]
["PTC50day5days7000.4","PTC",50,"day","5days",50.247999999999998,700,0.4,0.38953138549600003,0.353597548506]
["PTC200day7days11000.5","PTC",200,"day","7days",70.802999999999997,1100,0.5,0.39041719151400001,0.36138027240199999]
["PTC100continuous5days11000.3","PTC",100,"continuous","5days",75.516999999999996,1100,0.3,0.39153527687400003,0.35736809560499999]
["PTC50continuous5days7000.3","PTC",50,"continuous","5days",50.247999999999998,700,0.3,0.391835941829,0.35764368119200002]
["PTC100continuous7days7000.4","PTC",100,"continuous","7days",48.055999999999997,700,0.4,0.39445260102899998,0.36599522934399997]
["PTC200day7days3000.3","PTC",200,"day","7days",19.309999999999999,300,0.3,0.39484217160799995,0.36155498101699995]
["PTC50continuous5days11000.4","PTC",50,"continuous","5days",78.962000000000003,1100,0.4,0.39514805302599998,0.36119308912300002]
["PTC100continuous5days15000.4","PTC",100,"continuous","5days",102.977,1500,0.4,0.39528900774199999,0.36139707187300002]
["PTC50continuous5days15000.5","PTC",50,"continuous","5days",107.675,1500,0.5,0.39652239198599998,0.36263256355399998]
["PTC200continuous7days11000.3","PTC",200,"continuous","7days",70.802999999999997,1100,0.3,0.39672869685200002,0.36591077354599999]
["PTC100day5days15000.5","PTC",100,"day","5days",102.977,1500,0.5,0.39689801653000001,0.36215159543999997]
["PTC50day5days3000.5","PTC",50,"day","5days",21.535,300,0.5,0.39839669719800003,0.36114858630500002]
["PTC100day5days15000.3","PTC",100,"day","5days",102.977,1500,0.3,0.39868164124099997,0.362923363246]
["PTC200day7days15000.5","PTC",200,"day","7days",96.549000000000007,1500,0.5,0.40036133122200002,0.36967778225600001]
["PTC50day5days11000.3","PTC",50,"day","5days",78.962000000000003,1100,0.3,0.40079199946799998,0.363871330981]
["PTC100day5days15000.4","PTC",100,"day","5days",102.977,1500,0.4,0.40082497173699999,0.36477537246000002]
["PTC200day7days7000.4","PTC",200,"day","7days",45.055999999999997,700,0.4,0.40145622760400002,0.36930769531899998]
["PTC200day7days7000.3","PTC",200,"day","7days",45.055999999999997,700,0.3,0.40289958557099997,0.36900101011699998]
["PTC150continuous7days11000.4","PTC",150,"continuous","7days",72.697999999999993,1100,0.4,0.40354041032100002,0.37310823510300001]
["PTC50day5days11000.5","PTC",50,"day","5days",78.962000000000003,1100,0.5,0.405214180398,0.36911262426500002]
["PTC50day5days11000.4","PTC",50,"day","5days",78.962000000000003,1100,0.4,0.40793095135700003,0.370165984033]
["PTC100continuous5days15000.3","PTC",100,"continuous","5days",102.977,1500,0.3,0.40921875076999997,0.37267340699599999]
["PTC200day7days11000.3","PTC",200,"day","7days",70.802999999999997,1100,0.3,0.410956999534,0.37644703921700001]
["PTC200continuous7days15000.3","PTC",200,"continuous","7days",96.549000000000007,1500,0.3,0.411426357859,0.37856919816500001]
[{"$f":"B706&C706&D706&E706&G706&H706","v":"PTC100continuous7days3000.3"},"PTC",100,"continuous","7days",20.594999999999999,300,0.3,0.41183910641100002,0.384108969957]
["PTC200day7days11000.4","PTC",200,"day","7days",70.802999999999997,1100,0.4,0.41335761590999998,0.37952780737699998]
["PTC200day7days15000.3","PTC",200,"day","7days",96.549000000000007,1500,0.3,0.41537697745000002,0.38054689122000002]
["PTC50day5days15000.3","PTC",50,"day","5days",107.675,1500,0.3,0.416026287946,0.37768613277300001]
["PTC50continuous5days11000.3","PTC",50,"continuous","5days",78.962000000000003,1100,0.3,0.41656413951799998,0.37882234459500003]
["PTC200day7days15000.4","PTC",200,"day","7days",96.549000000000007,1500,0.4,0.41851348294700003,0.383966928358]
["PTC50day5days15000.5","PTC",50,"day","5days",107.675,1500,0.5,0.419120645954,0.381371964989]
["PTC50day5days15000.4","PTC",50,"day","5days",107.675,1500,0.4,0.42176073019299998,0.38263851497099999]
["PTC150continuous7days7000.3","PTC",150,"continuous","7days",46.262,700,0.3,0.42228468009999998,0.390576451815]
["PTC50continuous5days15000.4","PTC",50,"continuous","5days",107.675,1500,0.4,0.42313407880100001,0.38576661639900001]
["PTC150day7days7000.5","PTC",150,"day","7days",46.262,700,0.5,0.42569293789500001,0.39396394143199998]
["PTC50continuous7days11000.5","PTC",50,"continuous","7days",78.962000000000003,1100,0.5,0.42616284264900001,0.39329951457399998]
["PTC50continuous5days15000.3","PTC",50,"continuous","5days",107.675,1500,0.3,0.43310715723999998,0.393210897773]
["PTC50continuous7days7000.4","PTC",50,"continuous","7days",50.247999999999998,700,0.4,0.43411611509999998,0.40183383846999998]
["PTC100continuous7days15000.5","PTC",100,"continuous","7days",102.977,1500,0.5,0.43678129340799998,0.40330962669800002]
["PTC150continuous7days15000.4","PTC",150,"continuous","7days",99.134,1500,0.4,0.43796893627200001,0.40320352024599998]
["PTC100day7days3000.5","PTC",100,"day","7days",20.594999999999999,300,0.5,0.44047002266800001,0.410018334358]
["PTC150day7days3000.4","PTC",150,"day","7days",19.827000000000002,300,0.4,0.44387072642799996,0.40729814142999993]
["PTC150day7days11000.5","PTC",150,"day","7days",72.697999999999993,1100,0.5,0.44745159706299997,0.41259090953999999]
["PTC150day7days3000.3","PTC",150,"day","7days",19.827000000000002,300,0.3,0.44916329705300001,0.41039941986699996]
["PTC100continuous7days11000.4","PTC",100,"continuous","7days",75.516999999999996,1100,0.4,0.45036365708199999,0.41525655487200003]
["PTC150continuous7days11000.3","PTC",150,"continuous","7days",72.697999999999993,1100,0.3,0.450605468585,0.41466204978900001]
["PTC150day7days7000.4","PTC",150,"day","7days",46.262,700,0.4,0.45466826759399998,0.41684445653199997]
["PTC150day7days7000.3","PTC",150,"day","7days",46.262,700,0.3,0.456969244158,0.41765701062999999]
["PTC150day7days15000.5","PTC",150,"day","7days",99.134,1500,0.5,0.45835623619999999,0.42175945522399999]
["PTC150day7days11000.3","PTC",150,"day","7days",72.697999999999993,1100,0.3,0.46477519126299999,0.42491460139300002]
["PTC150continuous7days15000.3","PTC",150,"continuous","7days",99.134,1500,0.3,0.46506777297399998,0.42691333517899999]
["PTC150day7days11000.4","PTC",150,"day","7days",72.697999999999993,1100,0.4,0.46546580875999999,0.42639077163400002]
["PTC150day7days15000.3","PTC",150,"day","7days",99.134,1500,0.3,0.46857425655099999,0.42847619694299999]
["PTC150day7days15000.4","PTC",150,"day","7days",99.134,1500,0.4,0.470636809878,0.43094698129999998]
["PTC100continuous7days7000.3","PTC",100,"continuous","7days",48.055999999999997,700,0.3,0.471608053965,0.434851652501]
["PTC50continuous7days15000.5","PTC",50,"continuous","7days",107.675,1500,0.5,0.47968622041699999,0.44132464845899999]
["PTC100day7days7000.5","PTC",100,"day","7days",48.055999999999997,700,0.5,0.47998423087699998,0.44210596388099999]
["PTC50continuous7days3000.3","PTC",50,"continuous","7days",21.535,300,0.3,0.483919812211,0.45372021890300002]
["PTC100continuous7days15000.4","PTC",100,"continuous","7days",102.977,1500,0.4,0.48520516904400002,0.44575866087999999]
["PTC100day7days3000.4","PTC",100,"day","7days",20.594999999999999,300,0.4,0.48577542922299999,0.44450328680000001]
["PTC100day7days3000.3","PTC",100,"day","7days",20.594999999999999,300,0.3,0.48913181746400003,0.44630022273099995]
["PTC50continuous7days11000.4","PTC",50,"continuous","7days",78.962000000000003,1100,0.4,0.49121132302100001,0.45162555814700001]
["PTC100day7days7000.4","PTC",100,"day","7days",48.055999999999997,700,0.4,0.49728572174699998,0.454732244836]
["PTC100continuous7days11000.3","PTC",100,"continuous","7days",75.516999999999996,1100,0.3,0.49742740485600001,0.45646188141900002]
["PTC100day7days7000.3","PTC",100,"day","7days",48.055999999999997,700,0.3,0.49766772820999999,0.45412350501299997]
["PTC100day7days11000.5","PTC",100,"day","7days",75.516999999999996,1100,0.5,0.500477215586,0.45943309578000002]
["PTC50day7days3000.5","PTC",50,"day","7days",21.535,300,0.5,0.50526595828399989,0.46351034129699997]
["PTC50day7days3000.3","PTC",50,"day","7days",21.535,300,0.3,0.50614032029099998,0.45998210515100002]
["PTC100day7days11000.3","PTC",100,"day","7days",75.516999999999996,1100,0.3,0.50620363895599996,0.46194678729499999]
["PTC100day7days11000.4","PTC",100,"day","7days",75.516999999999996,1100,0.4,0.50879601427099996,0.46496120287199999]
["PTC50continuous7days7000.3","PTC",50,"continuous","7days",50.247999999999998,700,0.3,0.50953139416500004,0.46750999371200003]
["PTC100day7days15000.5","PTC",100,"day","7days",102.977,1500,0.5,0.510364673356,0.46760875852200001]
["PTC100day7days15000.3","PTC",100,"day","7days",102.977,1500,0.3,0.51050363884500005,0.46588480099899998]
["PTC100continuous7days15000.3","PTC",100,"continuous","7days",102.977,1500,0.3,0.51140216197699995,0.468161542067]
["PTC100day7days15000.4","PTC",100,"day","7days",102.977,1500,0.4,0.51392219380399995,0.46950344101899999]
["PTC50day7days3000.4","PTC",50,"day","7days",21.535,300,0.4,0.51540671760299994,0.46919338646100001]
["PTC50day7days7000.3","PTC",50,"day","7days",50.247999999999998,700,0.3,0.51792396334000002,0.47097246454300001]
["PTC50day7days7000.5","PTC",50,"day","7days",50.247999999999998,700,0.5,0.52079836729999995,0.47681109104699998]
["PTC50continuous7days15000.4","PTC",50,"continuous","7days",107.675,1500,0.4,0.52565169736700001,0.48171547436099998]
["PTC50day7days7000.4","PTC",50,"day","7days",50.247999999999998,700,0.4,0.52662214015099995,0.47944913847199999]
["PTC50day7days11000.3","PTC",50,"day","7days",78.962000000000003,1100,0.3,0.52970760638900005,0.48196282393500001]
["PTC50continuous7days11000.3","PTC",50,"continuous","7days",78.962000000000003,1100,0.3,0.53299267773199999,0.48708603651999999]
["PTC50day7days15000.3","PTC",50,"day","7days",107.675,1500,0.3,0.53560642054899998,0.48748396882099998]
["PTC50day7days11000.5","PTC",50,"day","7days",78.962000000000003,1100,0.5,0.53633077631600001,0.49011184079699999]
["PTC50day7days11000.4","PTC",50,"day","7days",78.962000000000003,1100,0.4,0.53783756269899996,0.48970489048299998]
["PTC50day7days15000.5","PTC",50,"day","7days",107.675,1500,0.5,0.54281614814099999,0.49552327106299998]
["PTC50day7days15000.4","PTC",50,"day","7days",107.675,1500,0.4,0.54287951242800003,0.49427757678299999]
["PTC50continuous7days15000.3","PTC",50,"continuous","7days",107.675,1500,0.3,0.54617073899900004,0.49808401003800001]