{"text_format":"2","workbook":"xlsx","n_sheets":7,"sheets":["LÉEME","ENTRADA-Lista de verificación","ENTRADA-Datos","SÁLIDA-Gráficos","VERSION CONTROL","Reference","Traducción"],"not_rendered":{"charts":4,"images":8,"macros":0,"external_links":0,"defined_names":2,"comments":1,"pivot_tables":0},"unopened":[],"bounds":{"document_bytes":16777216,"sheet_cells":100000,"run_cost":"one","rows_first":2000,"rows_last":500,"rows_between":2000,"halvings":0,"cell_chars":16384,"cell_head_chars":4096},"cells_cut":0,"cells_raw":0,"read":"whole","date_system":"1900"}

{"sheet":"LÉEME","index":0,"n_rows":85,"n_cols":7,"rows_kept":85,"cut":false,"hidden":false,"merged":[[46,6,47,8],[60,3,68,8],[84,3,84,5],[53,3,53,4],[53,5,53,7],[54,3,54,4],[54,5,54,8],[55,3,57,4],[55,5,56,8],[57,5,57,7],[58,3,58,4],[58,5,58,7],[69,3,77,8],[78,3,82,8],[51,3,52,4],[51,5,52,8],[34,3,36,5],[34,6,36,8],[37,3,39,5],[37,6,39,8],[40,3,41,5],[40,6,41,8],[44,3,45,5],[44,6,45,8],[42,3,43,5],[42,6,43,8],[49,3,49,8],[50,3,50,4],[50,5,50,6],[46,3,47,5],[10,3,10,8],[15,3,15,8],[17,3,17,8],[23,3,23,8],[31,3,31,8],[18,3,22,8]]}
{"$rows_empty":10}
[null,null,null,"Léeme"]
[]
[]
[]
[]
[null,null,null,"PROMUEVE – Herramienta de evaluación de impacto"]
[]
[null,null,null,"Introducción"]
[null,null,null,"Esta herramienta proporciona una guía sobre los posibles impactos de los sistemas de riego con energía solar en los aspectos socioeconómicos y ambientales. Los impactos pueden considerarse positivos, neutrales o negativos. Los impactos se agrupan en las siguientes áreas temáticas:\n1. Cambio de población y migración\n2. Papel de la mujer\n3. Grupos minoritarios e indígenas\n4. Ingresos y amenidad\n5. Efectos regionales en el país\n6. Participación del usuario\n7. Recursos naturales y el medio ambiente\nAl utilizar la lista de verificación, los asesores de SPIS pueden involucrarse más en la evaluación del cambio socioeconómico y ambiental y en la planificación de la mitigación de los impactos adversos. La lista de verificación permite que la experiencia especialista se use con mayor eficacia y promoverá una cooperación más estrecha entre especialistas y no especialistas en el desarrollo de proyectos sociales, económicos y ambientalmente sostenibles.\n\nLa lista de verificación ya se puede utilizar durante el diseño de un sistema SPIS, así como después de que se haya instalado y utilizado el SPIS, asegurando un seguimiento continuo. La herramienta es particularmente relevante para el Módulo PROMUEVE de la caja de herramientas de SPIS."]
[]
[]
[]
[]
[null,null,null,"Consejos y trucos"]
{"$rows_empty":7}
[null,null,null,"Sinopsis"]
[null,null,null,"Esta herramienta incluye las siguientes hojas:"]
[]
[null,null,null,"ENTRADA - Lista de verificación",null,null,"Esta hoja incluye preguntas que llevan el diseñador del SPIS a evaluar y ponderar los aspectos socioeconómicos y ambientales del proyecto. Las repuestas generan gráficos que aparecen en la hoja de SALIDA."]
[]
[]
[null,null,null,"ENTRADA - Datos",null,null,"Esta hoja permite la entrada de datos para dar una visión general los los benificiarios del proyecto. Los valores generan gráficos que aparecen en la hoja SALIDA."]
[]
[]
[null,null,null,"SALIDO - Gráficos",null,null,"Esta hoja contiene gráficos, generados por las hojas de ENTRADA. Se pueden usar para la evaluación y en informes más aplios para demostrar los impactos socioeconómicos y ambientales del proyecto."]
[]
[null,null,null,"Version Control",null,null,"Oculto. Esta hoja contiene detalles sobre las versiones y cambios realizados en cada revisión de esta herramienta. "]
[]
[null,null,null,"Reference",null,null,"Oculto. Resultados de referencia y referencias de las preguntas contenidas en estas hojas de ENTRADA. "]
{"$rows_left_out":27}
{"sheet":"ENTRADA-Lista de verificación","index":1,"n_rows":92,"n_cols":8,"rows_kept":92,"cut":false,"hidden":false,"merged":[[30,1,30,2],[22,2,22,4],[52,1,52,6],[44,1,44,6],[32,1,32,2],[33,1,33,2],[34,1,34,2],[35,1,35,2],[36,1,36,2],[38,1,38,2],[39,1,39,2],[45,1,45,2],[46,1,46,2],[48,1,48,2],[49,1,49,2],[50,1,50,2],[51,1,51,2],[37,1,37,6],[24,1,24,2],[29,1,29,2],[2,0,2,6],[7,4,7,5],[19,1,19,2],[20,1,20,2],[25,1,25,2],[26,1,26,2],[23,1,23,2],[22,5,22,6],[27,1,27,2],[28,1,28,2],[1,0,1,6],[0,1,0,6],[47,1,47,2],[16,1,16,2],[8,4,8,5],[9,4,9,5],[5,4,5,5],[6,4,6,5],[3,4,3,5],[4,4,4,5],[31,1,31,2],[14,1,14,6],[15,1,15,2],[17,1,17,2],[18,1,18,2],[21,1,21,2],[53,1,53,2],[54,1,54,2],[55,1,55,2],[56,1,56,2],[57,1,57,2],[85,1,85,2],[83,1,83,2],[59,1,59,2],[60,1,60,2],[61,1,61,2],[63,1,63,2],[62,1,62,6],[76,1,76,2],[77,1,77,2],[78,1,78,2],[79,1,79,2],[80,1,80,2],[71,1,71,2],[72,1,72,2],[75,1,75,2],[91,1,91,2],[40,1,40,2],[42,1,42,2],[41,1,41,2],[86,1,86,2],[87,1,87,2],[88,1,88,2],[89,1,89,2],[64,1,64,2],[65,1,65,2],[66,1,66,2],[67,1,67,2],[69,1,69,2],[81,1,81,2],[82,1,82,2],[68,1,68,6],[58,1,58,2],[70,1,70,2],[73,1,73,2],[74,1,74,2]]}
[null,"PROMUEVE – Herramienta de evaluación de impacto"]
["IMPACTOS SOCIOECONÓMICOS Y AMBIENTALES"]
["Esta lista de verificación es para evaluar aproximadamente los impactos socioeconómicos y ambientales de los sistemas de riego solar."]
[null,1,{"$f":"B15","v":"Cambio de población y migración"},{"$f":"SUM(H16:H22)","v":35},"Nombre del proyecto:",null,"Prueba"]
[null,2,{"$f":"B23","v":"Papel de la mujer"},{"$f":"SUM(H24:H37)","v":70},"Ubicación del proyecto:"]
[null,3,{"$f":"B38","v":"Grupos minoritarios e indígenas"},{"$f":"SUM(H39:H44)","v":30},"Nombre del usario:"]
[null,4,{"$f":"B45","v":"Ingresos y servicios"},{"$f":"SUM(H46:H52)","v":35},"Fecha de la evaluación de impacto"]
[null,5,{"$f":"B53","v":"Efectos regionales en el país"},{"$f":"SUM(H54:H62)","v":45},"Duración del proyecto (años)"]
[null,6,{"$f":"B63","v":"Participación del usario"},{"$f":"SUM(H64:H68)","v":25},"Vida útil del activo (años)"]
[null,7,{"$f":"B69","v":"Recursos naturales y medio ambiente"},{"$f":"SUM(H70:H92)","v":115},"Notas:"]
[null,null,"PUNTUACIÓN",{"$f":"SUM(D4+D7+D5+D6+D10+D8+D9)","v":355}]
[]
[]
["Ref #","Pregunta",null,"Sí / No","Ponderación\n(Importancia para el proyecto)","¿Cuál es el impacto del proyecto?","Comentarios"]
[1,"Cambio de población y migración"]
["1a","¿Se han considerado los cambios en el tamaño / densidad de la población y la composición demográfica / étnica en la planificación del proyecto?",null,"Yes","Medium","Positive impact is very likely",null,{"$f":"IFERROR(IF(D16=\"Yes\",(VLOOKUP(E16,Reference!$A$9:$B$11,2,FALSE)*VLOOKUP(F16,Reference!$A$2:$B$7,2,FALSE)*VLOOKUP(D16,Reference!$A$14:$B$15,2,FALSE)),(VLOOKUP(E16,Reference!$A$9:$B$11,2,FALSE)*VLOOKUP(F16,Reference!$A$2:$C$7,3,FALSE)*VLOOKUP(D16,Reference!$A$14:$B$15,2,FALSE))),\" \")","v":5}]
["1b","¿El proyecto está causando cambios demográficos significativos en el área o en proximidad del proyecto que podrían afectar la armonía social?",null,"Yes","Medium","Positive impact is very likely",null,{"$f":"IFERROR(IF(D17=\"Yes\",(VLOOKUP(E17,Reference!$A$9:$B$11,2,FALSE)*VLOOKUP(F17,Reference!$A$2:$B$7,2,FALSE)*VLOOKUP(D17,Reference!$A$14:$B$15,2,FALSE)),(VLOOKUP(E17,Reference!$A$9:$B$11,2,FALSE)*VLOOKUP(F17,Reference!$A$2:$C$7,3,FALSE)*VLOOKUP(D17,Reference!$A$14:$B$15,2,FALSE))),\" \")","v":5}]
["1c","¿El proyecto está evitando el desplazamiento físico y económico de personas?",null,"Yes","Medium","Positive impact is very likely",null,{"$f":"IFERROR(IF(D18=\"Yes\",(VLOOKUP(E18,Reference!$A$9:$B$11,2,FALSE)*VLOOKUP(F18,Reference!$A$2:$B$7,2,FALSE)*VLOOKUP(D18,Reference!$A$14:$B$15,2,FALSE)),(VLOOKUP(E18,Reference!$A$9:$B$11,2,FALSE)*VLOOKUP(F18,Reference!$A$2:$C$7,3,FALSE)*VLOOKUP(D18,Reference!$A$14:$B$15,2,FALSE))),\" \")","v":5}]
["1d","¿Se ha considerado la migración humana desde la ubicación del proyecto (por ejemplo éxodo rural) y hacia ella (por ejemplo, la demanda (estacional) de mano de obra agrícola)?",null,"Yes","Medium","Positive impact is very likely",null,{"$f":"IFERROR(IF(D19=\"Yes\",(VLOOKUP(E19,Reference!$A$9:$B$11,2,FALSE)*VLOOKUP(F19,Reference!$A$2:$B$7,2,FALSE)*VLOOKUP(D19,Reference!$A$14:$B$15,2,FALSE)),(VLOOKUP(E19,Reference!$A$9:$B$11,2,FALSE)*VLOOKUP(F19,Reference!$A$2:$C$7,3,FALSE)*VLOOKUP(D19,Reference!$A$14:$B$15,2,FALSE))),\" \")","v":5}]
["1e","¿Asegura el proyecto un empleo rural digno, promoviendo más y mejores oportunidades de empleo y condiciones de trabajo, y evitando prácticas, que podrían aumentar la vulnerabilidad de los trabajadores?",null,"Yes","Medium","Positive impact is very likely",null,{"$f":"IFERROR(IF(D20=\"Yes\",(VLOOKUP(E20,Reference!$A$9:$B$11,2,FALSE)*VLOOKUP(F20,Reference!$A$2:$B$7,2,FALSE)*VLOOKUP(D20,Reference!$A$14:$B$15,2,FALSE)),(VLOOKUP(E20,Reference!$A$9:$B$11,2,FALSE)*VLOOKUP(F20,Reference!$A$2:$C$7,3,FALSE)*VLOOKUP(D20,Reference!$A$14:$B$15,2,FALSE))),\" \")","v":5}]
["1f","¿El proyecto respeta los principios y derechos fundamentales en el trabajo y prohíbe el trabajo infantil?",null,"Yes","Medium","Positive impact is very likely",null,{"$f":"IFERROR(IF(D21=\"Yes\",(VLOOKUP(E21,Reference!$A$9:$B$11,2,FALSE)*VLOOKUP(F21,Reference!$A$2:$B$7,2,FALSE)*VLOOKUP(D21,Reference!$A$14:$B$15,2,FALSE)),(VLOOKUP(E21,Reference!$A$9:$B$11,2,FALSE)*VLOOKUP(F21,Reference!$A$2:$C$7,3,FALSE)*VLOOKUP(D21,Reference!$A$14:$B$15,2,FALSE))),\" \")","v":5}]
["1g","¿Se han tomado medidas adecuadas para cualquier afluencia de población migratoria o temporal para evitar entre los grupos permanentes y temporales la privación social, las dificultades o los conflictos?",null,"Yes","Medium","Positive impact is very likely",null,{"$f":"IFERROR(IF(D22=\"Yes\",(VLOOKUP(E22,Reference!$A$9:$B$11,2,FALSE)*VLOOKUP(F22,Reference!$A$2:$B$7,2,FALSE)*VLOOKUP(D22,Reference!$A$14:$B$15,2,FALSE)),(VLOOKUP(E22,Reference!$A$9:$B$11,2,FALSE)*VLOOKUP(F22,Reference!$A$2:$C$7,3,FALSE)*VLOOKUP(D22,Reference!$A$14:$B$15,2,FALSE))),\" \")","v":5}]
[2,"Papel de la mujer","para preguntas en más profundidad y aspectos a considerar, consulte:",null,null,"http://www.fao.org/docrep/017/i3173e/i3173e.pdf"]
["2a","¿Se han tenido en cuenta las necesidades, las prioridades y las limitaciones de los dos, mujeres y hombres, durante el diseño del proyecto?",null,"Yes","Medium","Positive impact is very likely",null,{"$f":"IFERROR(IF(D24=\"Yes\",(VLOOKUP(E24,Reference!$A$9:$B$11,2,FALSE)*VLOOKUP(F24,Reference!$A$2:$B$7,2,FALSE)*VLOOKUP(D24,Reference!$A$14:$B$15,2,FALSE)),(VLOOKUP(E24,Reference!$A$9:$B$11,2,FALSE)*VLOOKUP(F24,Reference!$A$2:$C$7,3,FALSE)*VLOOKUP(D24,Reference!$A$14:$B$15,2,FALSE))),\" \")","v":5}]
["2b","¿El proyecto cambia positivamente el estado y el papel de las mujeres en relación con la posición social?",null,"Yes","Medium","Positive impact is very likely",null,{"$f":"IFERROR(IF(D25=\"Yes\",(VLOOKUP(E25,Reference!$A$9:$B$11,2,FALSE)*VLOOKUP(F25,Reference!$A$2:$B$7,2,FALSE)*VLOOKUP(D25,Reference!$A$14:$B$15,2,FALSE)),(VLOOKUP(E25,Reference!$A$9:$B$11,2,FALSE)*VLOOKUP(F25,Reference!$A$2:$C$7,3,FALSE)*VLOOKUP(D25,Reference!$A$14:$B$15,2,FALSE))),\" \")","v":5}]
["2c","¿El proyecto cambia positivamente el estado y el papel de las mujeres en relación con la carga de trabajo?",null,"Yes","Medium","Positive impact is very likely",null,{"$f":"IFERROR(IF(D26=\"Yes\",(VLOOKUP(E26,Reference!$A$9:$B$11,2,FALSE)*VLOOKUP(F26,Reference!$A$2:$B$7,2,FALSE)*VLOOKUP(D26,Reference!$A$14:$B$15,2,FALSE)),(VLOOKUP(E26,Reference!$A$9:$B$11,2,FALSE)*VLOOKUP(F26,Reference!$A$2:$C$7,3,FALSE)*VLOOKUP(D26,Reference!$A$14:$B$15,2,FALSE))),\" \")","v":5}]
["2d","¿El proyecto cambia positivamente el estado y el papel de las mujeres en relación con el acceso a los mercados, los ingresos y las finanzas?",null,"Yes","Medium","Positive impact is very likely",null,{"$f":"IFERROR(IF(D27=\"Yes\",(VLOOKUP(E27,Reference!$A$9:$B$11,2,FALSE)*VLOOKUP(F27,Reference!$A$2:$B$7,2,FALSE)*VLOOKUP(D27,Reference!$A$14:$B$15,2,FALSE)),(VLOOKUP(E27,Reference!$A$9:$B$11,2,FALSE)*VLOOKUP(F27,Reference!$A$2:$C$7,3,FALSE)*VLOOKUP(D27,Reference!$A$14:$B$15,2,FALSE))),\" \")","v":5}]
["2e","¿El proyecto cambia positivamente el estado y el papel de las mujeres en relación con el patrimonio y la herencia?",null,"Yes","Medium","Positive impact is very likely",null,{"$f":"IFERROR(IF(D28=\"Yes\",(VLOOKUP(E28,Reference!$A$9:$B$11,2,FALSE)*VLOOKUP(F28,Reference!$A$2:$B$7,2,FALSE)*VLOOKUP(D28,Reference!$A$14:$B$15,2,FALSE)),(VLOOKUP(E28,Reference!$A$9:$B$11,2,FALSE)*VLOOKUP(F28,Reference!$A$2:$C$7,3,FALSE)*VLOOKUP(D28,Reference!$A$14:$B$15,2,FALSE))),\" \")","v":5}]
["2f","¿El proyecto cambia positivamente el estado y el papel de las mujeres en relación con los derechos matrimoniales?",null,"Yes","Medium","Positive impact is very likely",null,{"$f":"IFERROR(IF(D29=\"Yes\",(VLOOKUP(E29,Reference!$A$9:$B$11,2,FALSE)*VLOOKUP(F29,Reference!$A$2:$B$7,2,FALSE)*VLOOKUP(D29,Reference!$A$14:$B$15,2,FALSE)),(VLOOKUP(E29,Reference!$A$9:$B$11,2,FALSE)*VLOOKUP(F29,Reference!$A$2:$C$7,3,FALSE)*VLOOKUP(D29,Reference!$A$14:$B$15,2,FALSE))),\" \")","v":5}]
["2g","¿El proyecto promueve a las mujeres y hombres el acceso equitativo a y el control de los recursos y servicios productivos?",null,"Yes","Medium","Positive impact is very likely",null,{"$f":"IFERROR(IF(D30=\"Yes\",(VLOOKUP(E30,Reference!$A$9:$B$11,2,FALSE)*VLOOKUP(F30,Reference!$A$2:$B$7,2,FALSE)*VLOOKUP(D30,Reference!$A$14:$B$15,2,FALSE)),(VLOOKUP(E30,Reference!$A$9:$B$11,2,FALSE)*VLOOKUP(F30,Reference!$A$2:$C$7,3,FALSE)*VLOOKUP(D30,Reference!$A$14:$B$15,2,FALSE))),\" \")","v":5}]
{"$rows_left_out":63}
{"sheet":"ENTRADA-Datos","index":2,"n_rows":45,"n_cols":6,"rows_kept":45,"cut":false,"hidden":false,"merged":[[39,1,39,5],[0,0,0,5],[1,0,1,5],[7,1,7,5],[19,1,19,5],[25,1,25,5]]}
["PROMUEVE – Herramienta de evaluación de impacto"]
["DATOS SOCIOECONÓMICOS"]
["Ref #","Pregunta","NÚMERO ABSOLUTO","PORCENTAJE [%]","COMENTARIOS DEL USUARIO","COMENTARIOS DEL REVISOR DEL PROYECTO"]
["A1.0","¿Cuál es la población en las proximidades del proyecto?\n"]
["A1.1","¿Cuántas personas serán afectadas por el proyecto?\n",null,{"$f":"IFERROR(C5/C4,\"-\")","v":"-"}]
["A1.2","¿Cuántos agricultores serán afectados por el proyecto?",null,{"$f":"IFERROR(C6/C5,\"-\")","v":"-"}]
[null,"TOTAL",{"$f":"SUM(C5:C6)","v":0},{"$f":"C7/C4","v":{"$error":"#DIV/0!"}}]
["A2.0","¿Cuál es el desglose de la población de agricultores beneficiados por el proyecto en categorías de género, clase socioeconómica e ingresos?\n"]
["A2.1","Hombre",null,{"$f":"IFERROR(C9/(C9+C10),\"-\")","v":"-"}]
["A2.2","Mujer",null,{"$f":"IFERROR(C10/(C9+C10),\"-\")","v":"-"}]
[null,"TOTAL",{"$f":"SUM(C9:C10)","v":0},{"$f":"C11/C6","v":{"$error":"#DIV/0!"}}]
["A2.3","Grupo tipo 1",null,{"$f":"IFERROR(C12/($C$12+$C$13+$C$14+$C$15),\"-\")","v":"-"}]
["A2.4","Grupo tipo 2",null,{"$f":"IFERROR(C13/($C$12+$C$13+$C$14+$C$15),\"-\")","v":"-"}]
["A2.5","Grupo tipo 3",null,{"$f":"IFERROR(C14/($C$12+$C$13+$C$14+$C$15),\"-\")","v":"-"}]
["A2.6","Grupo tipo 4",null,{"$f":"IFERROR(C15/($C$12+$C$13+$C$14+$C$15),\"-\")","v":"-"}]
[null,"TOTAL",{"$f":"SUM(C12:C15)","v":0},{"$f":"C16/C6","v":{"$error":"#DIV/0!"}}]
["A2.7","Desempleados",null,{"$f":"IFERROR(C17/(C9+C10),\"-\")","v":"-"}]
["A2.8","Debajo de la línea de pobreza",null,{"$f":"IFERROR(C18/(C9+C10),\"-\")","v":"-"}]
[null,"TOTAL",{"$f":"SUM(C17:C18)","v":0},{"$f":"C19/C11","v":{"$error":"#DIV/0!"}}]
["A3.0","¿De dónde se han contratado los agricultores beneficiados?"]
["A3.1","Local en en pueblo",null,{"$f":"IFERROR(C21/($C$21+$C$22+$C$23+$C$24),\"-\")","v":"-"}]
["A3.2","Local reasentada",null,{"$f":"IFERROR(C22/($C$21+$C$22+$C$23+$C$24),\"-\")","v":"-"}]
["A3.3","Fondo sociológico igual de otro lado",null,{"$f":"IFERROR(C23/($C$21+$C$22+$C$23+$C$24),\"-\")","v":"-"}]
["A3.4","Fondo sociológico diferente",null,{"$f":"IFERROR(C24/($C$21+$C$22+$C$23+$C$24),\"-\")","v":"-"}]
[null,"TOTAL",{"$f":"SUM(C21:C24)","v":0},{"$f":"C25/C6","v":{"$error":"#DIV/0!"}}]
["A4.0","¿Cuáles son los requisitos laborales del proyecto?"]
["A4.1","Trabajo familiar",null,{"$f":"IFERROR(C27/($C$27+$C$28+$C$29+$C$30),\"-\")","v":"-"}]
["A4.2","Trabajo local",null,{"$f":"IFERROR(C28/($C$27+$C$28+$C$29+$C$30),\"-\")","v":"-"}]
["A4.3","Trabajo estacional",null,{"$f":"IFERROR(C29/($C$27+$C$28+$C$29+$C$30),\"-\")","v":"-"}]
["A4.4","Trabajo estacional desde lejos",null,{"$f":"IFERROR(C30/($C$27+$C$28+$C$29+$C$30),\"-\")","v":"-"}]
{"$rows_left_out":16}
{"sheet":"SÁLIDA-Gráficos","index":3,"n_rows":33,"n_cols":13,"rows_kept":33,"cut":false,"hidden":false,"merged":[[0,1,0,12],[4,12,4,16],[5,12,5,16],[3,1,3,5],[4,1,4,5],[5,1,5,5],[3,12,3,16]]}
[null,"PROMUEVE – Herramienta de evaluación de impacto"]
[]
[]
["Nombre del proyecto:",{"$f":"'ENTRADA-Lista de verificación'!G4","v":"Prueba"},{"$nulls":5},"Fecha de la evaluación de impacto",{"$nulls":4},{"$f":"'ENTRADA-Lista de verificación'!G7","v":0}]
["Ubicación del proyecto:",{"$f":"'ENTRADA-Lista de verificación'!G5","v":0},{"$nulls":5},"Duración del proyecto (años)",{"$nulls":4},{"$f":"'ENTRADA-Lista de verificación'!G8","v":0}]
["Nombre del usario:",{"$f":"'ENTRADA-Lista de verificación'!G6","v":0},{"$nulls":5},"Vida útil del activo (años)",{"$nulls":4},{"$f":"'ENTRADA-Lista de verificación'!G9","v":0}]
[]
[]
[]
[]
[null,"Lowest score possible","Highest possible score","Actual Score","correction factor","% Reached"]
[{"$f":"'ENTRADA-Lista de verificación'!C4","v":"Cambio de población y migración"},{"$f":"0-C12","v":-52.5},{"$f":"COUNTA('ENTRADA-Lista de verificación'!A16:A22)*7.5","v":52.5},{"$f":"'ENTRADA-Lista de verificación'!D4","v":35},{"$f":"120/C12","v":2.2857142857142856},{"$f":"(E12*'ENTRADA-Lista de verificación'!D4)/120","v":0.66666666666666663}]
[{"$f":"'ENTRADA-Lista de verificación'!C5","v":"Papel de la mujer"},{"$f":"0-C13","v":-105},{"$f":"COUNTA('ENTRADA-Lista de verificación'!A24:A37)*7.5","v":105},{"$f":"'ENTRADA-Lista de verificación'!D5","v":70},{"$f":"120/C13","v":1.1428571428571428},{"$f":"(E13*'ENTRADA-Lista de verificación'!D5)/120","v":0.66666666666666663}]
[{"$f":"'ENTRADA-Lista de verificación'!C6","v":"Grupos minoritarios e indígenas"},-45,{"$f":"COUNTA('ENTRADA-Lista de verificación'!A39:A44)*7.5","v":45},{"$f":"'ENTRADA-Lista de verificación'!D6","v":30},2.6666666666666665,{"$f":"(E14*'ENTRADA-Lista de verificación'!D6)/120","v":0.66666666666666663}]
[{"$f":"'ENTRADA-Lista de verificación'!C7","v":"Ingresos y servicios"},-52.5,{"$f":"COUNTA('ENTRADA-Lista de verificación'!A46:A52)*7.5","v":52.5},{"$f":"'ENTRADA-Lista de verificación'!D7","v":35},2.2857142857142856,{"$f":"(E15*'ENTRADA-Lista de verificación'!D7)/120","v":0.66666666666666663}]
[{"$f":"'ENTRADA-Lista de verificación'!C8","v":"Efectos regionales en el país"},-67.5,{"$f":"COUNTA('ENTRADA-Lista de verificación'!A54:A62)*7.5","v":67.5},{"$f":"'ENTRADA-Lista de verificación'!D8","v":45},1.7777777777777777,{"$f":"(E16*'ENTRADA-Lista de verificación'!D8)/120","v":0.66666666666666663}]
[{"$f":"'ENTRADA-Lista de verificación'!C9","v":"Participación del usario"},-37.5,{"$f":"COUNTA('ENTRADA-Lista de verificación'!A64:A68)*7.5","v":37.5},{"$f":"'ENTRADA-Lista de verificación'!D9","v":25},3.2,{"$f":"(E17*'ENTRADA-Lista de verificación'!D9)/120","v":0.66666666666666663}]
[{"$f":"'ENTRADA-Lista de verificación'!C10","v":"Recursos naturales y medio ambiente"},-172.5,{"$f":"COUNTA('ENTRADA-Lista de verificación'!A70:A92)*7.5","v":172.5},{"$f":"'ENTRADA-Lista de verificación'!D10","v":115},{"$f":"120/C18","v":0.69565217391304346},{"$f":"(E18*'ENTRADA-Lista de verificación'!D10)/120","v":0.66666666666666663}]
[]
[]
[]
["Gender and Socioeconomic Spread of Project Beneficiaries"]
[]
[{"$f":"'ENTRADA-Datos'!B9","v":"Hombre"},{"$f":"'ENTRADA-Datos'!D9","v":"-"}]
[{"$f":"'ENTRADA-Datos'!B10","v":"Mujer"},{"$f":"'ENTRADA-Datos'!D10","v":"-"}]
[{"$f":"'ENTRADA-Datos'!B12","v":"Grupo tipo 1"},{"$f":"'ENTRADA-Datos'!D12","v":"-"}]
[{"$f":"'ENTRADA-Datos'!B13","v":"Grupo tipo 2"},{"$f":"'ENTRADA-Datos'!D13","v":"-"}]
[{"$f":"'ENTRADA-Datos'!B14","v":"Grupo tipo 3"},{"$f":"'ENTRADA-Datos'!D14","v":"-"}]
[{"$f":"'ENTRADA-Datos'!B15","v":"Grupo tipo 4"},{"$f":"'ENTRADA-Datos'!D15","v":"-"}]
[{"$f":"'ENTRADA-Datos'!B41","v":"Terrateniente"},{"$f":"'ENTRADA-Datos'!D41","v":"-"}]
{"$rows_left_out":4}
{"sheet":"VERSION CONTROL","index":4,"n_rows":22,"n_cols":5,"rows_kept":22,"cut":false,"hidden":true,"merged":[[27,3,27,7],[21,3,21,7],[22,3,22,7],[23,3,23,7],[24,3,24,7],[25,3,25,7],[26,3,26,7],[8,4,8,7],[8,2,8,3],[20,3,20,7],[9,3,11,7],[13,2,13,3],[13,4,13,6],[14,2,14,3],[14,4,14,6],[15,2,15,3],[15,4,15,6],[17,3,17,7],[18,3,18,7],[19,3,19,7]]}
{"$rows_empty":9}
[null,null,null,"Tranlsation of ICID Checklist for Socioeconomic perspectives for SPIS projects"]
[]
[]
[]
[null,null,"Created By",null,"Alqayam Meghji"]
[null,null,"Checked By",null,"Lucie Pluschke"]
[null,null,"Reviewed By"]
[]
[null,"Date","Rev:","Comments"]
[null,"19/03/18",0.1,"Draft for review"]
[null,"23/03/18",0.2,"Inclusion of equity and efficieny"]
[null,"28/03/18",0.3,"Inclusion of environmental considerations and conditional formatting"]
[null,"29/03/18",0.4,"Changes made after review with Lucie Plushke"]

{"sheet":"Reference","index":5,"n_rows":29,"n_cols":3,"rows_kept":29,"cut":false,"hidden":true,"merged":[]}
["Impact","Score YES","Score NO"]
["Positive impact is very likely",5,1]
["Positive impact possible",2,1]
["No impact likely",1,1]
["Negative impact possible",-2,4]
["Negative impact very likely",-5,5]
[]
["Weighting","Linear Multiplier"]
["High",1.5]
["Medium",1]
["Low",0.5]
[]
["Weighting","Linear Multiplier"]
["Yes",1]
["No",-1]
[]
["Questions"]
["https://ec.europa.eu/agriculture/publi/reports/sustain/index_en.pdf  "]
[]
[]
[]
[]
[]
[]
["Agroecology","http://www.fao.org/agroecology/knowledge/10-elements/en/"]
[]
["Questions not included:"]
["Optimum utilisation of the factors of production, in particular labour, increase of agricultural productivity"]
["Assurance of the availability of supplies"]

{"sheet":"Traducción","index":6,"n_rows":16,"n_cols":3,"rows_kept":16,"cut":false,"hidden":false,"merged":[[1,0,1,2],[4,0,4,4]]}
[]
["HOJA DE TRADUCCIÓN "]
[]
["Introducción"]
["Algunas partes del texto usado en esta herramienta forman parte de fórmulas basadas en reconocimento de texto. Para mantener la integridad y el funcionamiento de las fórmulas, dichos fragmentos permanecerán en inglés. Una lista de los fragmentos de texto y su traducción correspondiente ha sido compilada en esta hoja de traducción complementaria:"]
["Texto original en inglés","Hoja","Traducción al español"]
["High","ENTRADA-Lista de verificación","Alto"]
["Low","ENTRADA-Lista de verificación","Bajo"]
["Medium","ENTRADA-Lista de verificación","Medio"]
["Negative impact possible","ENTRADA-Lista de verificación","Impacto negativo posible"]
["Negative impact very likely","ENTRADA-Lista de verificación","Impacto negativo muy probable"]
["No","ENTRADA-Lista de verificación","No"]
["No impact likely","ENTRADA-Lista de verificación","Probablemente sin impacto"]
["Positive impact is very likely","ENTRADA-Lista de verificación","Impacto positivo muy probable"]
["Positive impact possible","ENTRADA-Lista de verificación","Impacto positivo posible"]
["Yes","ENTRADA-Lista de verificación","Sí"]