{"text_format":"2","workbook":"xlsx","n_sheets":7,"sheets":["Read Me","Input","Output","Cashflow Calculation","Loan Repayment Solar","Loan Repayment Grid","Loan Repayment Diesel"],"not_rendered":{"charts":5,"images":5,"macros":0,"external_links":0,"defined_names":231,"comments":0,"pivot_tables":0},"unopened":[],"bounds":{"document_bytes":16777216,"sheet_cells":100000,"run_cost":"one","rows_first":2000,"rows_last":500,"rows_between":2000,"halvings":0,"cell_chars":16384,"cell_head_chars":4096},"cells_cut":0,"cells_raw":0,"read":"whole","date_system":"1900"}

{"sheet":"Read Me","index":0,"n_rows":63,"n_cols":4,"rows_kept":63,"cut":false,"hidden":false,"merged":[[14,1,14,2],[13,3,13,9],[14,3,14,9],[11,1,11,8],[7,0,7,9],[12,0,12,9],[8,0,8,9],[13,1,13,2],[0,0,0,9],[2,0,2,8],[5,1,5,8],[6,1,6,8],[9,1,9,8],[76,1,76,8],[30,1,30,8],[74,1,74,8],[75,1,75,8],[29,1,29,10],[31,1,31,7],[32,1,32,10],[35,1,43,8],[45,1,55,8],[56,1,61,8],[28,1,28,8],[20,1,20,8],[23,1,23,8],[24,1,24,8],[25,1,25,8],[27,1,27,8],[21,0,21,9],[22,0,22,9],[15,3,15,9],[16,3,16,9],[17,3,17,9],[18,3,18,9],[15,1,15,2],[16,1,16,2],[17,1,17,2],[18,1,18,2]]}
["Read Me Sheet"]
[]
["Toolbox on Solar Powered Irrigation Systems (SPIS)"]
[]
[]
[null,"Introduction"]
[null,"Design – Simplified Financial Viability Tool"]
["This tool allows for a comparative assessment between income and two (2) different irrigation pumping options."]
["Information required for using this tool includes investment and operational costs for the different pumping systems, anticipated income from agricultural production and basic economic conditions (e.g. inflation rate)"]
[]
[]
[null,"Overview"]
["This tool comprises the following sheets:"]
[null," \"Input\"",null,"for data entry of anticipated income and expenditure for pumping and irrigation technology"]
[null,"\"Output\"",null,"for analysis of results automatically generated from Input sheet"]
[null,"\"Loan Repayment Solar\"",null,"Hidden. For review of loan repayment schedule automatically generated from Input sheet"]
[null,"\"Loan Repayment Grid\"",null,"Hidden. For review of loan repayment schedule automatically generated from Input sheet"]
[null,"\"Loan Repayment Diesel\"",null,"Hidden. For review of loan repayment schedule automatically generated from Input sheet"]
[null,"\"Cashflow calculation\"",null,"Hidden. For review of loan repayment schedule automatically generated from Input sheet"]
[]
{"$rows_left_out":27}
{"sheet":"Input","index":1,"n_rows":114,"n_cols":11,"rows_kept":114,"cut":false,"hidden":false,"merged":[[0,1,0,8],[91,1,92,1],[113,4,113,5],[82,4,82,5],[31,1,32,1],[60,1,61,1],[50,4,50,5]]}
[null,"Design – Simplified Financial Viability Tool"]
[]
[null,"This INPUT sheet requires entry of values, which then serve the results displayed in the next OUTPUT sheet."]
[null,null," "]
[]
[null,"Basic assumptions"]
[]
[null,"Currency used for calculation:",null,null,"KES","use any currency"]
[]
[null,"Inflation",null,null,0.1148,"the national percentage rate for the devaluation of money per year"]
[]
[null,"Discount rate",null,null,0.16,"the annual rate used to determine the present value of future cash flows"]
[]
[null,"Annual profit margin increase",null,null,0.01,"the rate at which the farmer will increase prices every year"]
[]
[null,"Annual fuel price increase",null,null,3.8399999999999997E-2,"the rate at which the energyprice (fuel & electricity) will increase every year"]
[]
[]
[null,"Total water need per day",null,null,26,"m³ per day"]
[]
{"$rows_left_out":95}
{"sheet":"Output","index":2,"n_rows":87,"n_cols":9,"rows_kept":87,"cut":false,"hidden":false,"merged":[[0,0,0,7]]}
["Design – Simplified Financial Viability Tool"]
[]
["This OUTPUT sheet summarises the results as per the entries in the afore completed INPUT sheet."]
{"$rows_empty":20}
["Basic assumptions"]
[]
["Total water need per day",null,null,{"$f":"Input!E19 & \" m³ per day\"","v":"26 m³ per day"}]
[]
["Total income per year",null,null,{"$f":"TEXT(Input!E21,\"#.##0\") &\" \" & Input!E8","v":"523.911 KES"}]
[]
["Inflation",null,null,{"$f":"Input!E10","v":0.1148}]
[]
["Discount rate",null,null,{"$f":"Input!E12","v":0.16}]
[]
["Annual profit margin increase",null,null,{"$f":"Input!E14","v":0.01}]
[]
["Annual fuel price increase",null,null,{"$f":"Input!E16","v":3.8399999999999997E-2}]
[]
["Average annual gross profit (first 10 years)",null,null,{"$f":"TEXT(AVERAGE('Cashflow Calculation'!E9:N9),\"#.##0\") & \" \" &Input!E8 & \" per year\"","v":"548.127 KES per year"}]
[]
{"$rows_left_out":49}
{"sheet":"Cashflow Calculation","index":3,"n_rows":192,"n_cols":29,"rows_kept":192,"cut":false,"hidden":true,"merged":[[91,15,91,16],[92,13,92,14],[92,15,92,16],[149,1,150,1],[175,5,175,7],[45,1,46,1],[83,1,84,1],[91,13,91,14]]}
["Annual profit margin increase:",{"$f":"Input!E14","v":0.01}]
["Inflation rate:",{"$f":"Input!E10","v":0.1148}]
["Gross product/year:",{"$f":"Input!E21","v":523911},{"$f":"IF(Input!$E$8=\"\",\"\",Input!$E$8)","v":"KES"}]
["Fuel price increase/year: ",{"$f":"Input!E16","v":3.8399999999999997E-2}]
["Discount rate",{"$f":"Input!E12","v":0.16}]
[]
[]
[null,null,"year",0,1,2,3,4,5,6,7,8,9,10,11,12,13,14,15,16,17,18,19,20,21,22,23,24,25]
[null,null,{"$f":"IF(Input!$E$8=\"\",\"\",Input!$E$8)","v":"KES"},0,{"$f":"B3","v":523911},{"$f":"E9*(1+(1*$B$1))","v":529150.11},534441.61109999998,539786.02721099998,545183.88748310995,550635.72635794105,556142.08362152043,561703.50445773569,567320.53950231301,572993.74489733612,578723.68234630954,584510.91916977265,590356.02836147044,596259.58864508511,602222.18453153595,608244.40637685137,614326.85044061986,620470.11894502607,626674.82013447629,632941.56833582104,639270.98401917925,645663.69385937101,652120.33079796471,658641.53410594433,665227.94944700378]
["Gross product per year:"]
[true,null,"accumulated",{"$f":"IF($A$11=TRUE,D12,NA())","v":0},{"$f":"IF($A$11=TRUE,E12,NA())","v":523911},1053061.1099999999,1587502.7210999997,2127288.7483109999,2672472.6357941097,3223108.3621520507,3779250.4457735713,4340953.9502313072,4908274.4897336205,5481268.2346309563,6059991.9169772658,6644502.8361470383,7234858.8645085087,7831118.4531535935,8433340.6376851294,9041585.0440619811,9655911.8945026007,10276382.013447627,10903056.833582103,11535998.401917925,12175269.385937104,12820933.079796474,13473053.410594439,14131694.944700383,14796922.894147387]
[null,null,null,0,{"$f":"E9","v":523911},{"$f":"SUM($E$9:F9)","v":1053061.1099999999},{"$f":"SUM($E$9:G9)","v":1587502.7210999997},{"$f":"SUM($E$9:H9)","v":2127288.7483109999},{"$f":"SUM($E$9:I9)","v":2672472.6357941097},{"$f":"SUM($E$9:J9)","v":3223108.3621520507},{"$f":"SUM($E$9:K9)","v":3779250.4457735713},{"$f":"SUM($E$9:L9)","v":4340953.9502313072},{"$f":"SUM($E$9:M9)","v":4908274.4897336205},{"$f":"SUM($E$9:N9)","v":5481268.2346309563},{"$f":"SUM($E$9:O9)","v":6059991.9169772658},{"$f":"SUM($E$9:P9)","v":6644502.8361470383},{"$f":"SUM($E$9:Q9)","v":7234858.8645085087},{"$f":"SUM($E$9:R9)","v":7831118.4531535935},{"$f":"SUM($E$9:S9)","v":8433340.6376851294},{"$f":"SUM($E$9:T9)","v":9041585.0440619811},{"$f":"SUM($E$9:U9)","v":9655911.8945026007},{"$f":"SUM($E$9:V9)","v":10276382.013447627},{"$f":"SUM($E$9:W9)","v":10903056.833582103},{"$f":"SUM($E$9:X9)","v":11535998.401917925},{"$f":"SUM($E$9:Y9)","v":12175269.385937104},{"$f":"SUM($E$9:Z9)","v":12820933.079796474},{"$f":"SUM($E$9:AA9)","v":13473053.410594439},{"$f":"SUM($E$9:AB9)","v":14131694.944700383},{"$f":"SUM($E$9:AC9)","v":14796922.894147387}]
[]
[]
[]
[]
[]
[{"$f":"Input!D26","v":"Solar powered irrigation system costs"}]
[]
[]
{"$rows_left_out":150}
{"sheet":"Loan Repayment Solar","index":4,"n_rows":379,"n_cols":10,"rows_kept":379,"cut":false,"hidden":true,"merged":[[0,0,0,4],[0,5,0,9],[8,1,8,3],[8,5,8,7]]}
["Loan Repayment:",{"$nulls":4},{"$f":"Input!D26","v":"Solar powered irrigation system costs"}]
["Bank:",{"$f":"Input!E51","v":0}]
[]
[]
[]
[]
[]
[]
[null,"Enter Values",null,null,null,"Loan Summary"]
[null,null,"Loan Amount",{"$f":"Input!E48","v":0},null,null,"Scheduled Payment",{"$f":"IF(Values_Entered,-PMT(Interest_Rate/Num_Pmt_Per_Year,Loan_Years*Num_Pmt_Per_Year,Loan_Amount),\"0\")","v":"0"}]
[null,null,"Annual Interest Rate",{"$f":"Input!E49","v":0},null,null,"Scheduled Number of Payments",{"$f":"IF(Values_Entered,Loan_Years*Num_Pmt_Per_Year,\"\")","v":""}]
[null,null,"Loan Period in Years",{"$f":"Input!E50","v":0},null,null,"Actual Number of Payments",{"$f":"IF(Values_Entered,Number_of_Payments,\"\")","v":""}]
[null,null,"Number of Payments Per Year",1,null,null,"Total Early Payments",{"$f":"IF(Values_Entered,SUMIF(Beg_Bal,\">0\",Extra_Pay),\"\")","v":""}]
[null,null,"Start Date of Loan","2017-01-01",null,null,"Total Interest",{"$f":"IF(Values_Entered,SUMIF(Beg_Bal,\">0\",Int),\"\")","v":""}]
[null,null,"Optional Extra Payments",0]
[]
[]
["PmtNo.","Payment Date","Beginning Balance","Scheduled Payment","Extra Payment","Total Payment","Principal","Interest","Ending Balance","Cumulative Interest"]
[]
[{"$f":"IF(Values_Entered,1,\"\")","v":""},{"$f":"IF(Pay_Num<>\"\",DATE(YEAR(Loan_Start),MONTH(Loan_Start)+(Pay_Num)*12/Num_Pmt_Per_Year,DAY(Loan_Start)),\"\")","v":""},{"$f":"IF(Values_Entered,Loan_Amount,\"\")","v":""},{"$f":"IF(Pay_Num<>\"\",Scheduled_Monthly_Payment,\"\")","v":""},{"$f":"IF(AND(Pay_Num<>\"\",Sched_Pay+Scheduled_Extra_Payments<Beg_Bal),Scheduled_Extra_Payments,IF(AND(Pay_Num<>\"\",Beg_Bal-Sched_Pay>0),Beg_Bal-Sched_Pay,IF(Pay_Num<>\"\",0,\"\")))","v":{"$error":"#VALUE!"}},{"$f":"IF(AND(Pay_Num<>\"\",Sched_Pay+Extra_Pay<Beg_Bal),Sched_Pay+Extra_Pay,IF(Pay_Num<>\"\",Beg_Bal,\"\"))","v":{"$error":"#VALUE!"}},{"$f":"IF(Pay_Num<>\"\",Total_Pay-Int,\"\")","v":""},{"$f":"IF(Pay_Num<>\"\",Beg_Bal*(Interest_Rate/Num_Pmt_Per_Year),\"\")","v":""},{"$f":"IF(AND(Pay_Num<>\"\",Sched_Pay+Extra_Pay<Beg_Bal),Beg_Bal-Princ,IF(Pay_Num<>\"\",0,\"\"))","v":{"$error":"#VALUE!"}},{"$f":"SUM($H$20:$H20)","v":0}]
{"$rows_left_out":360}
{"sheet":"Loan Repayment Grid","index":5,"n_rows":379,"n_cols":10,"rows_kept":379,"cut":false,"hidden":true,"merged":[[0,0,0,4],[0,5,0,9],[8,1,8,3],[8,5,8,7]]}
["Loan Repayment:",{"$nulls":4},{"$f":"Input!D55","v":"Grid powered irrigation system costs"}]
["Bank:",{"$f":"Input!E83","v":0}]
[]
[]
[]
[]
[]
[]
[null,"Enter Values",null,null,null,"Loan Summary"]
[null,null,"Loan Amount",{"$f":"Input!E80","v":0},null,null,"Scheduled Payment",{"$f":"IF(Values_Entered,-PMT(Interest_Rate/Num_Pmt_Per_Year,Loan_Years*Num_Pmt_Per_Year,Loan_Amount),\"0\")","v":"0"}]
[null,null,"Annual Interest Rate",{"$f":"Input!E81","v":0},null,null,"Scheduled Number of Payments",{"$f":"IF(Values_Entered,Loan_Years*Num_Pmt_Per_Year,\"\")","v":""}]
[null,null,"Loan Period in Years",{"$f":"Input!E82","v":0},null,null,"Actual Number of Payments",{"$f":"IF(Values_Entered,Number_of_Payments,\"\")","v":""}]
[null,null,"Number of Payments Per Year",1,null,null,"Total Early Payments",{"$f":"IF(Values_Entered,SUMIF(Beg_Bal,\">0\",Extra_Pay),\"\")","v":""}]
[null,null,"Start Date of Loan","2017-01-01",null,null,"Total Interest",{"$f":"IF(Values_Entered,SUMIF(Beg_Bal,\">0\",Int),\"\")","v":""}]
[null,null,"Optional Extra Payments",0]
[]
[]
["PmtNo.","Payment Date","Beginning Balance","Scheduled Payment","Extra Payment","Total Payment","Principal","Interest","Ending Balance","Cumulative Interest"]
[]
[{"$f":"IF(Values_Entered,1,\"\")","v":""},{"$f":"IF(Pay_Num<>\"\",DATE(YEAR(Loan_Start),MONTH(Loan_Start)+(Pay_Num)*12/Num_Pmt_Per_Year,DAY(Loan_Start)),\"\")","v":""},{"$f":"IF(Values_Entered,Loan_Amount,\"\")","v":""},{"$f":"IF(Pay_Num<>\"\",Scheduled_Monthly_Payment,\"\")","v":""},{"$f":"IF(AND(Pay_Num<>\"\",Sched_Pay+Scheduled_Extra_Payments<Beg_Bal),Scheduled_Extra_Payments,IF(AND(Pay_Num<>\"\",Beg_Bal-Sched_Pay>0),Beg_Bal-Sched_Pay,IF(Pay_Num<>\"\",0,\"\")))","v":{"$error":"#VALUE!"}},{"$f":"IF(AND(Pay_Num<>\"\",Sched_Pay+Extra_Pay<Beg_Bal),Sched_Pay+Extra_Pay,IF(Pay_Num<>\"\",Beg_Bal,\"\"))","v":{"$error":"#VALUE!"}},{"$f":"IF(Pay_Num<>\"\",Total_Pay-Int,\"\")","v":""},{"$f":"IF(Pay_Num<>\"\",Beg_Bal*(Interest_Rate/Num_Pmt_Per_Year),\"\")","v":""},{"$f":"IF(AND(Pay_Num<>\"\",Sched_Pay+Extra_Pay<Beg_Bal),Beg_Bal-Princ,IF(Pay_Num<>\"\",0,\"\"))","v":{"$error":"#VALUE!"}},{"$f":"SUM($H$20:$H20)","v":0}]
{"$rows_left_out":360}
{"sheet":"Loan Repayment Diesel","index":6,"n_rows":379,"n_cols":10,"rows_kept":379,"cut":false,"hidden":true,"merged":[[0,0,0,4],[0,5,0,9],[8,1,8,3],[8,5,8,7]]}
["Loan Repayment:",{"$nulls":4},{"$f":"Input!D55","v":"Grid powered irrigation system costs"}]
["Bank:",{"$f":"Input!E114","v":0}]
[]
[]
[]
[]
[]
[]
[null,"Enter Values",null,null,null,"Loan Summary"]
[null,null,"Loan Amount",{"$f":"Input!E111","v":0},null,null,"Scheduled Payment",{"$f":"IF(Values_Entered,-PMT(Interest_Rate/Num_Pmt_Per_Year,Loan_Years*Num_Pmt_Per_Year,Loan_Amount),\"0\")","v":"0"}]
[null,null,"Annual Interest Rate",{"$f":"Input!E112","v":0},null,null,"Scheduled Number of Payments",{"$f":"IF(Values_Entered,Loan_Years*Num_Pmt_Per_Year,\"\")","v":""}]
[null,null,"Loan Period in Years",{"$f":"Input!E113","v":0},null,null,"Actual Number of Payments",{"$f":"IF(Values_Entered,Number_of_Payments,\"\")","v":""}]
[null,null,"Number of Payments Per Year",1,null,null,"Total Early Payments",{"$f":"IF(Values_Entered,SUMIF(Beg_Bal,\">0\",Extra_Pay),\"\")","v":""}]
[null,null,"Start Date of Loan","2017-01-01",null,null,"Total Interest",{"$f":"IF(Values_Entered,SUMIF(Beg_Bal,\">0\",Int),\"\")","v":""}]
[null,null,"Optional Extra Payments",0]
[]
[]
["PmtNo.","Payment Date","Beginning Balance","Scheduled Payment","Extra Payment","Total Payment","Principal","Interest","Ending Balance","Cumulative Interest"]
[]
[{"$f":"IF(Values_Entered,1,\"\")","v":""},{"$f":"IF(Pay_Num<>\"\",DATE(YEAR(Loan_Start),MONTH(Loan_Start)+(Pay_Num)*12/Num_Pmt_Per_Year,DAY(Loan_Start)),\"\")","v":""},{"$f":"IF(Values_Entered,Loan_Amount,\"\")","v":""},{"$f":"IF(Pay_Num<>\"\",Scheduled_Monthly_Payment,\"\")","v":""},{"$f":"IF(AND(Pay_Num<>\"\",Sched_Pay+Scheduled_Extra_Payments<Beg_Bal),Scheduled_Extra_Payments,IF(AND(Pay_Num<>\"\",Beg_Bal-Sched_Pay>0),Beg_Bal-Sched_Pay,IF(Pay_Num<>\"\",0,\"\")))","v":{"$error":"#VALUE!"}},{"$f":"IF(AND(Pay_Num<>\"\",Sched_Pay+Extra_Pay<Beg_Bal),Sched_Pay+Extra_Pay,IF(Pay_Num<>\"\",Beg_Bal,\"\"))","v":{"$error":"#VALUE!"}},{"$f":"IF(Pay_Num<>\"\",Total_Pay-Int,\"\")","v":""},{"$f":"IF(Pay_Num<>\"\",Beg_Bal*(Interest_Rate/Num_Pmt_Per_Year),\"\")","v":""},{"$f":"IF(AND(Pay_Num<>\"\",Sched_Pay+Extra_Pay<Beg_Bal),Beg_Bal-Princ,IF(Pay_Num<>\"\",0,\"\"))","v":{"$error":"#VALUE!"}},{"$f":"SUM($H$20:$H20)","v":0}]
{"$rows_left_out":359}