{"text_format":"2","workbook":"xlsx","n_sheets":7,"sheets":["LISEZ-MOI","INPUT_Fiche de controle","INPUT_Donnée","OUTPUT_Graphe","VERSION CONTROL","Reference","Feuille de traduction"],"not_rendered":{"charts":4,"images":8,"macros":0,"external_links":0,"defined_names":2,"comments":1,"pivot_tables":0},"unopened":[],"bounds":{"document_bytes":16777216,"sheet_cells":100000,"run_cost":"one","rows_first":2000,"rows_last":500,"rows_between":2000,"halvings":0,"cell_chars":16384,"cell_head_chars":4096},"cells_cut":0,"cells_raw":0,"read":"whole","date_system":"1900"}

{"sheet":"LISEZ-MOI","index":0,"n_rows":84,"n_cols":7,"rows_kept":84,"cut":false,"hidden":false,"merged":[[83,3,83,5],[53,3,53,4],[53,5,53,7],[54,3,54,4],[54,5,54,8],[55,3,57,4],[55,5,56,8],[57,5,57,7],[58,3,58,4],[58,5,58,7],[60,3,67,8],[68,3,76,8],[77,3,81,8],[51,3,52,4],[51,5,52,8],[34,3,36,5],[34,6,36,8],[37,3,39,5],[37,6,39,8],[40,3,41,5],[40,6,41,8],[44,3,45,5],[44,6,45,8],[42,3,43,5],[42,6,43,8],[49,3,49,8],[50,3,50,4],[50,5,50,6],[10,3,10,8],[15,3,15,8],[17,3,17,8],[23,3,23,8],[31,3,31,8],[18,3,21,8]]}
{"$rows_empty":10}
[null,null,null,"Lisez Moi"]
[]
[]
[]
[]
[null,null,null,"PROMOTION et INITIATION - Outil d’évaluation d’impact"]
[]
[null,null,null,"Introduction"]
[null,null,null,"Cet outil fournit un guide sur les impacts possibles des systèmes d’irrigation à énergie solaire sur les aspects socioéconomiques et environnementaux. Les impacts peuvent être considérés comme positifs, neutres ou négatifs. Les impacts sont regroupés dans les domaines suivants:\n1. Changement de population et migration\n2. Le rôle des femmes\n3. Groupes minoritaires et autochtones\n4. Revenu et commodité\n5. Effets régionaux dans le pays\n6. Participation de l'utilisateur\n7. Ressources naturelles et environnement\nEn utilisant la liste de contrôle, les conseillers SPIS peuvent s'impliquer davantage dans l'évaluation des changements socio-économiques et environnementaux et dans la planification de l'atténuation des impacts négatifs. La liste de contrôle devrait permettre une utilisation plus efficace des compétences spécialisées et favoriserait une coopération plus étroite entre spécialistes et non spécialistes dans le développement de projets durables sur les plans social, économique et environnemental.\n\nLa liste de contrôle peut déjà être utilisée dans la conception d’un système SPIS ainsi qu’après son installation et son utilisation (par exemple 6 mois, 2 ans et 5 ans) pour une surveillance continue. Cet outil est particulièrement utile pour les modules PROMOTION et INITIATION de la boîte à outils SPIS."]
[]
[]
[]
[]
[null,null,null,"Tips & Tricks"]
{"$rows_empty":7}
[null,null,null,"APERCU"]
[null,null,null,"Cet outil comprend les feuilles suivantes:"]
[]
[null,null,null,"Fiche de contrôle ",null,null,"Cette fiche comprend des questions qui incitent le concepteur du SPIS à évaluer et à peser les aspects socio-économiques et environnementaux du projet. Les réponses génèrent des graphiques pour la feuille OUTPUT. "]
[]
[]
[null,null,null,"Données",null,null,"Cela permet de saisir des données qui donnent une vue d'ensemble des bénéficiaires du projet. Les valeurs génèrent des graphiques pour la feuille OUTPUT."]
[]
[]
[null,null,null,"Graphe",null,null,"Cette fiche contient des graphiques, générés par les fiches INPUT, qui peuvent être utilisés pour l'évaluation et dans des rapports plus larges pour démontrer les impacts socio-économiques et environnementaux du projet."]
[]
[null,null,null,"Contrôle de Version ",null,null,"Masqué. Cette fiche détaille les versions et les modifications apportées à chaque révision de cet outil."]
[]
[null,null,null,"Reference",null,null,"Masqué. Scores de référence et références pour les questions contenues dans la fiche Saisie"]
{"$rows_left_out":27}
{"sheet":"INPUT_Fiche de controle","index":1,"n_rows":92,"n_cols":8,"rows_kept":92,"cut":false,"hidden":false,"merged":[[90,1,90,2],[52,1,52,6],[44,1,44,6],[32,1,32,2],[33,1,33,2],[34,1,34,2],[35,1,35,2],[36,1,36,2],[38,1,38,2],[39,1,39,2],[45,1,45,2],[46,1,46,2],[48,1,48,2],[49,1,49,2],[50,1,50,2],[51,1,51,2],[37,1,37,6],[24,1,24,2],[29,1,29,2],[2,0,2,6],[7,4,7,5],[19,1,19,2],[20,1,20,2],[25,1,25,2],[26,1,26,2],[23,1,23,2],[22,5,22,6],[27,1,27,2],[28,1,28,2],[30,1,30,2],[22,2,22,4],[1,0,1,6],[0,1,0,6],[47,1,47,2],[16,1,16,2],[8,4,8,5],[9,4,9,5],[5,4,5,5],[6,4,6,5],[3,4,3,5],[4,4,4,5],[31,1,31,2],[14,1,14,6],[15,1,15,2],[17,1,17,2],[18,1,18,2],[21,1,21,2],[53,1,53,2],[54,1,54,2],[55,1,55,2],[56,1,56,2],[57,1,57,2],[40,1,40,2],[42,1,42,2],[41,1,41,2],[86,1,86,2],[87,1,87,2],[64,1,64,2],[65,1,65,2],[66,1,66,2],[67,1,67,2],[69,1,69,2],[82,1,82,2],[68,1,68,6],[85,1,85,2],[83,1,83,2],[59,1,59,2],[58,1,58,2],[91,1,91,2],[88,1,88,2],[89,1,89,2],[60,1,60,2],[61,1,61,2],[63,1,63,2],[62,1,62,6],[76,1,76,2],[77,1,77,2],[78,1,78,2],[79,1,79,2],[75,1,75,2],[70,1,70,2],[73,1,73,2],[74,1,74,2],[84,1,84,2]]}
[null,"PROMOTION et INITIATION - Outil d’évaluation d’impact"]
["SOCIO-ECONOMIC AND ENVIRONMENTAL IMPACTS"]
["Cette liste de contrôle a pour but d’évaluer en détail les impacts socio-économiques et environnementaux des systèmes d’irrigation à énergie solaire."]
[null,1,"Changement de population et migration",{"$f":"SUM(H16:H22)","v":34},"Nom du projet:",null,"échantillon"]
[null,2,"Rôle des femmes",{"$f":"SUM(H24:H37)","v":70},"Lieu du projet:"]
[null,3,"Groupes minoritaires et indigènes",{"$f":"SUM(H39:H44)","v":30},"Nom d'utilisateur:"]
[null,4,"Revenu et commodités",{"$f":"SUM(H46:H52)","v":35},"Date de l'évaluation d'impact:"]
[null,5,"Effets régionaux dans le pays",{"$f":"SUM(H54:H62)","v":45},"Durée du projet (années):"]
[null,6,"Participation de l'utilisateur",{"$f":"SUM(H64:H68)","v":25},"Durée de vie des actifs (années):"]
[null,7,"Ressources naturelles et environnement",{"$f":"SUM(H70:H92)","v":115},"Remarques:"]
[null,null,"SCORE",{"$f":"SUM(D4+D7+D5+D6+D10+D8+D9)","v":354}]
[]
[]
["Ref #","Question",null,"\nOui, non ou N / A","Pondération\n(Quelle est l'importance de ce projet?)","\nQuel est l'impact du projet?","\ncommentaires"]
[1,"\nChangement de population et migration"]
["1a","Les changements de la taille / densité de la population et de la composition démographique / ethnique ont-ils été pris en compte dans la planification du projet?",null,"Yes","High","Positive impact is very likely",null,{"$f":"IFERROR(IF(D16=\"Yes\",(VLOOKUP(E16,Reference!$A$9:$B$11,2,FALSE)*VLOOKUP(F16,Reference!$A$2:$B$7,2,FALSE)*VLOOKUP(D16,Reference!$A$14:$B$15,2,FALSE)),(VLOOKUP(E16,Reference!$A$9:$B$11,2,FALSE)*VLOOKUP(F16,Reference!$A$2:$C$7,3,FALSE)*VLOOKUP(D16,Reference!$A$14:$B$15,2,FALSE))),\" \")","v":7.5}]
["1b","Le projet provoque-t-il des changements démographiques importants dans la zone du projet ou dans les environs, susceptibles d’affecter l’harmonie sociale?",null,"Yes","Medium","Positive impact is very likely",null,{"$f":"IFERROR(IF(D17=\"Yes\",(VLOOKUP(E17,Reference!$A$9:$B$11,2,FALSE)*VLOOKUP(F17,Reference!$A$2:$B$7,2,FALSE)*VLOOKUP(D17,Reference!$A$14:$B$15,2,FALSE)),(VLOOKUP(E17,Reference!$A$9:$B$11,2,FALSE)*VLOOKUP(F17,Reference!$A$2:$C$7,3,FALSE)*VLOOKUP(D17,Reference!$A$14:$B$15,2,FALSE))),\" \")","v":5}]
["1c","Le projet évite-t-il le déplacement physique et économique de personnes?",null,"Yes","High","Positive impact is very likely",null,{"$f":"IFERROR(IF(D18=\"Yes\",(VLOOKUP(E18,Reference!$A$9:$B$11,2,FALSE)*VLOOKUP(F18,Reference!$A$2:$B$7,2,FALSE)*VLOOKUP(D18,Reference!$A$14:$B$15,2,FALSE)),(VLOOKUP(E18,Reference!$A$9:$B$11,2,FALSE)*VLOOKUP(F18,Reference!$A$2:$C$7,3,FALSE)*VLOOKUP(D18,Reference!$A$14:$B$15,2,FALSE))),\" \")","v":7.5}]
["1d","La migration humaine, loin du lieu du projet (par exemple, une fuite en zone rurale) et vers celle-ci (par exemple, la demande de main-d’œuvre agricole (saisonnière)) a-t-elle été envisagée?",null,"No","Medium","Positive impact is very likely",null,{"$f":"IFERROR(IF(D19=\"Yes\",(VLOOKUP(E19,Reference!$A$9:$B$11,2,FALSE)*VLOOKUP(F19,Reference!$A$2:$B$7,2,FALSE)*VLOOKUP(D19,Reference!$A$14:$B$15,2,FALSE)),(VLOOKUP(E19,Reference!$A$9:$B$11,2,FALSE)*VLOOKUP(F19,Reference!$A$2:$C$7,3,FALSE)*VLOOKUP(D19,Reference!$A$14:$B$15,2,FALSE))),\" \")","v":-1}]
["1e","Le projet garantit-il un emploi rural décent, favorise-t-il des possibilités d’emploi et des conditions de travail plus nombreuses et de meilleure qualité et évite-t-il des pratiques qui pourraient accroître la vulnérabilité des travailleurs?",null,"Yes","Medium","Positive impact is very likely",null,{"$f":"IFERROR(IF(D20=\"Yes\",(VLOOKUP(E20,Reference!$A$9:$B$11,2,FALSE)*VLOOKUP(F20,Reference!$A$2:$B$7,2,FALSE)*VLOOKUP(D20,Reference!$A$14:$B$15,2,FALSE)),(VLOOKUP(E20,Reference!$A$9:$B$11,2,FALSE)*VLOOKUP(F20,Reference!$A$2:$C$7,3,FALSE)*VLOOKUP(D20,Reference!$A$14:$B$15,2,FALSE))),\" \")","v":5}]
["1f","Le projet respecte-t-il les principes et droits fondamentaux au travail et interdit-il le travail des enfants?",null,"Yes","Medium","Positive impact is very likely",null,{"$f":"IFERROR(IF(D21=\"Yes\",(VLOOKUP(E21,Reference!$A$9:$B$11,2,FALSE)*VLOOKUP(F21,Reference!$A$2:$B$7,2,FALSE)*VLOOKUP(D21,Reference!$A$14:$B$15,2,FALSE)),(VLOOKUP(E21,Reference!$A$9:$B$11,2,FALSE)*VLOOKUP(F21,Reference!$A$2:$C$7,3,FALSE)*VLOOKUP(D21,Reference!$A$14:$B$15,2,FALSE))),\" \")","v":5}]
["1g","Est-ce que des dispositions adéquates ont été prises pour tout afflux temporaire ou migratoire de population afin d'éviter la misère sociale, les difficultés ou les conflits entre les groupes permanents et temporaires?",null,"Yes","Medium","Positive impact is very likely",null,{"$f":"IFERROR(IF(D22=\"Yes\",(VLOOKUP(E22,Reference!$A$9:$B$11,2,FALSE)*VLOOKUP(F22,Reference!$A$2:$B$7,2,FALSE)*VLOOKUP(D22,Reference!$A$14:$B$15,2,FALSE)),(VLOOKUP(E22,Reference!$A$9:$B$11,2,FALSE)*VLOOKUP(F22,Reference!$A$2:$C$7,3,FALSE)*VLOOKUP(D22,Reference!$A$14:$B$15,2,FALSE))),\" \")","v":5}]
[2,"Rôle des femmes","pour plus de détails dans les questions et des aspects à considérer s'il vous plaît voir:",null,null,"http://www.fao.org/docrep/017/i3173e/i3173e.pdf"]
["2a","Les besoins, priorités et contraintes des femmes et des hommes ont-ils été pris en compte lors de la conception du projet?",null,"Yes","Medium","Positive impact is very likely",null,{"$f":"IFERROR(IF(D24=\"Yes\",(VLOOKUP(E24,Reference!$A$9:$B$11,2,FALSE)*VLOOKUP(F24,Reference!$A$2:$B$7,2,FALSE)*VLOOKUP(D24,Reference!$A$14:$B$15,2,FALSE)),(VLOOKUP(E24,Reference!$A$9:$B$11,2,FALSE)*VLOOKUP(F24,Reference!$A$2:$C$7,3,FALSE)*VLOOKUP(D24,Reference!$A$14:$B$15,2,FALSE))),\" \")","v":5}]
["2b","Le projet modifie-t-il positivement le statut et le rôle des femmes par rapport au statut social?",null,"Yes","Medium","Positive impact is very likely",null,{"$f":"IFERROR(IF(D25=\"Yes\",(VLOOKUP(E25,Reference!$A$9:$B$11,2,FALSE)*VLOOKUP(F25,Reference!$A$2:$B$7,2,FALSE)*VLOOKUP(D25,Reference!$A$14:$B$15,2,FALSE)),(VLOOKUP(E25,Reference!$A$9:$B$11,2,FALSE)*VLOOKUP(F25,Reference!$A$2:$C$7,3,FALSE)*VLOOKUP(D25,Reference!$A$14:$B$15,2,FALSE))),\" \")","v":5}]
["2c","Le projet change-t-il positivement le statut et le rôle des femmes par rapport à la charge de travail?",null,"Yes","Medium","Positive impact is very likely",null,{"$f":"IFERROR(IF(D26=\"Yes\",(VLOOKUP(E26,Reference!$A$9:$B$11,2,FALSE)*VLOOKUP(F26,Reference!$A$2:$B$7,2,FALSE)*VLOOKUP(D26,Reference!$A$14:$B$15,2,FALSE)),(VLOOKUP(E26,Reference!$A$9:$B$11,2,FALSE)*VLOOKUP(F26,Reference!$A$2:$C$7,3,FALSE)*VLOOKUP(D26,Reference!$A$14:$B$15,2,FALSE))),\" \")","v":5}]
["2d","Le projet modifie-t-il positivement le statut et le rôle des femmes en ce qui concerne l'accès aux marchés, aux revenus et aux finances?",null,"Yes","Medium","Positive impact is very likely",null,{"$f":"IFERROR(IF(D27=\"Yes\",(VLOOKUP(E27,Reference!$A$9:$B$11,2,FALSE)*VLOOKUP(F27,Reference!$A$2:$B$7,2,FALSE)*VLOOKUP(D27,Reference!$A$14:$B$15,2,FALSE)),(VLOOKUP(E27,Reference!$A$9:$B$11,2,FALSE)*VLOOKUP(F27,Reference!$A$2:$C$7,3,FALSE)*VLOOKUP(D27,Reference!$A$14:$B$15,2,FALSE))),\" \")","v":5}]
["2e","Le projet modifie-t-il positivement le statut et le rôle des femmes par rapport au patrimoine et à l'héritage?",null,"Yes","Medium","Positive impact is very likely",null,{"$f":"IFERROR(IF(D28=\"Yes\",(VLOOKUP(E28,Reference!$A$9:$B$11,2,FALSE)*VLOOKUP(F28,Reference!$A$2:$B$7,2,FALSE)*VLOOKUP(D28,Reference!$A$14:$B$15,2,FALSE)),(VLOOKUP(E28,Reference!$A$9:$B$11,2,FALSE)*VLOOKUP(F28,Reference!$A$2:$C$7,3,FALSE)*VLOOKUP(D28,Reference!$A$14:$B$15,2,FALSE))),\" \")","v":5}]
["2f","Le projet modifie-t-il positivement le statut et le rôle de la femme par rapport aux droits matrimoniaux?",null,"Yes","Medium","Positive impact is very likely",null,{"$f":"IFERROR(IF(D29=\"Yes\",(VLOOKUP(E29,Reference!$A$9:$B$11,2,FALSE)*VLOOKUP(F29,Reference!$A$2:$B$7,2,FALSE)*VLOOKUP(D29,Reference!$A$14:$B$15,2,FALSE)),(VLOOKUP(E29,Reference!$A$9:$B$11,2,FALSE)*VLOOKUP(F29,Reference!$A$2:$C$7,3,FALSE)*VLOOKUP(D29,Reference!$A$14:$B$15,2,FALSE))),\" \")","v":5}]
["2g","Le projet favorise-t-il l’accès équitable des femmes et des hommes aux ressources et services productifs et le contrôle de ces ressources?",null,"Yes","Medium","Positive impact is very likely",null,{"$f":"IFERROR(IF(D30=\"Yes\",(VLOOKUP(E30,Reference!$A$9:$B$11,2,FALSE)*VLOOKUP(F30,Reference!$A$2:$B$7,2,FALSE)*VLOOKUP(D30,Reference!$A$14:$B$15,2,FALSE)),(VLOOKUP(E30,Reference!$A$9:$B$11,2,FALSE)*VLOOKUP(F30,Reference!$A$2:$C$7,3,FALSE)*VLOOKUP(D30,Reference!$A$14:$B$15,2,FALSE))),\" \")","v":5}]
{"$rows_left_out":63}
{"sheet":"INPUT_Donnée","index":2,"n_rows":45,"n_cols":6,"rows_kept":45,"cut":false,"hidden":false,"merged":[[39,1,39,5],[0,0,0,5],[1,0,1,5],[7,1,7,5],[19,1,19,5],[25,1,25,5]]}
["PROMOTION et INITIATION - Outil d’évaluation d’impact"]
["DONNÉES SOCIO-ÉCONOMIQUES"]
["Ref #","Question","VALEUR ABSOLUE","POURCENTAGE [%]","Commentaires de l'utilisateur","COMMENTAIRES DE L'EXAMINATEUR DE PROJET"]
["A1.0","Quelle est la population dans les environs du projet? \n"]
["A1.1","Combien seront touchés par le projet?\n",null,{"$f":"IFERROR(C5/C4,\"-\")","v":"-"}]
["A1.2","\nCombien d'agriculteurs seront touchés par le projet?\n",null,{"$f":"IFERROR(C6/C5,\"-\")","v":"-"}]
[null,"TOTAL",{"$f":"SUM(C5:C6)","v":0},{"$f":"C7/C4","v":{"$error":"#DIV/0!"}}]
["A2.0","Quelle est la répartition des agriculteurs bénéficiant du projet par sexe, par délimitation socio-économique et par revenu?"]
["A2.1","Homme",null,{"$f":"IFERROR(C9/(C9+C10),\"-\")","v":"-"}]
["A2.2","Femme",null,{"$f":"IFERROR(C10/(C9+C10),\"-\")","v":"-"}]
[null,"TOTAL",{"$f":"SUM(C9:C10)","v":0},{"$f":"C11/C6","v":{"$error":"#DIV/0!"}}]
["A2.3","Groupe type 1",null,{"$f":"IFERROR(C12/($C$12+$C$13+$C$14+$C$15),\"-\")","v":"-"}]
["A2.4","Groupe type 2",null,{"$f":"IFERROR(C13/($C$12+$C$13+$C$14+$C$15),\"-\")","v":"-"}]
["A2.5","Groupe type 3",null,{"$f":"IFERROR(C14/($C$12+$C$13+$C$14+$C$15),\"-\")","v":"-"}]
["A2.6","Groupe type 4",null,{"$f":"IFERROR(C15/($C$12+$C$13+$C$14+$C$15),\"-\")","v":"-"}]
[null,"TOTAL",{"$f":"SUM(C12:C15)","v":0},{"$f":"C16/C6","v":{"$error":"#DIV/0!"}}]
["A2.7","Sans emploi",null,{"$f":"IFERROR(C17/(C9+C10),\"-\")","v":"-"}]
["A2.8","Sous le seuil de pauvreté",null,{"$f":"IFERROR(C18/(C9+C10),\"-\")","v":"-"}]
[null,"TOTAL",{"$f":"SUM(C17:C18)","v":0},{"$f":"C19/C11","v":{"$error":"#DIV/0!"}}]
["A3.0","Où sont recrutés les agriculteurs bénéficiaires?"]
["A3.1","population Locale dans le  village",null,{"$f":"IFERROR(C21/($C$21+$C$22+$C$23+$C$24),\"-\")","v":"-"}]
["A3.2","population Locale réinstallée",null,{"$f":"IFERROR(C22/($C$21+$C$22+$C$23+$C$24),\"-\")","v":"-"}]
["A3.3","Même contexte sociologique d'ailleurs",null,{"$f":"IFERROR(C23/($C$21+$C$22+$C$23+$C$24),\"-\")","v":"-"}]
["A3.4","Fond sociologique différent",null,{"$f":"IFERROR(C24/($C$21+$C$22+$C$23+$C$24),\"-\")","v":"-"}]
[null,"TOTAL",{"$f":"SUM(C21:C24)","v":0},{"$f":"C25/C6","v":{"$error":"#DIV/0!"}}]
["A4.0","Quels sont les besoins en main-d'œuvre du projet?"]
["A4.1","Dans la  famille",null,{"$f":"IFERROR(C27/($C$27+$C$28+$C$29+$C$30),\"-\")","v":"-"}]
["A4.2","Main d'œuvre locale",null,{"$f":"IFERROR(C28/($C$27+$C$28+$C$29+$C$30),\"-\")","v":"-"}]
["A4.3","Travaillleur local saisonnier",null,{"$f":"IFERROR(C29/($C$27+$C$28+$C$29+$C$30),\"-\")","v":"-"}]
["A4.4","Travaillleur  saisonnier venant de loin",null,{"$f":"IFERROR(C30/($C$27+$C$28+$C$29+$C$30),\"-\")","v":"-"}]
{"$rows_left_out":16}
{"sheet":"OUTPUT_Graphe","index":3,"n_rows":33,"n_cols":13,"rows_kept":33,"cut":false,"hidden":false,"merged":[[0,1,0,12],[4,12,4,16],[5,12,5,16],[3,1,3,5],[4,1,4,5],[5,1,5,5],[3,12,3,16]]}
[null,"\nPROMOTION et INITIATION - Outil d’évaluation d’impact"]
[]
[]
["Nom du projet:",{"$f":"'INPUT_Fiche de controle'!G4","v":"échantillon"},{"$nulls":5},"Date de l'évaluation d'impact:",{"$nulls":4},{"$f":"'INPUT_Fiche de controle'!G7","v":0}]
["Lieu du projet:",{"$f":"'INPUT_Fiche de controle'!G5","v":0},{"$nulls":5},"Durée du projet (années):",{"$nulls":4},{"$f":"'INPUT_Fiche de controle'!G8","v":0}]
["Nom d'utilisateur:",{"$f":"'INPUT_Fiche de controle'!G6","v":0},{"$nulls":5},"Durée de vie des actifs (années):",{"$nulls":4},{"$f":"'INPUT_Fiche de controle'!G9","v":0}]
[]
[]
[]
[]
[null,"Lowest score possible","Highest possible score","Actual Score","correction factor","% Reached"]
[{"$f":"'INPUT_Fiche de controle'!C4","v":"Changement de population et migration"},{"$f":"0-C12","v":-52.5},{"$f":"COUNTA('INPUT_Fiche de controle'!A16:A22)*7.5","v":52.5},{"$f":"'INPUT_Fiche de controle'!D4","v":34},{"$f":"120/C12","v":2.2857142857142856},{"$f":"(E12*'INPUT_Fiche de controle'!D4)/120","v":0.64761904761904754}]
[{"$f":"'INPUT_Fiche de controle'!C5","v":"Rôle des femmes"},{"$f":"0-C13","v":-105},{"$f":"COUNTA('INPUT_Fiche de controle'!A24:A37)*7.5","v":105},{"$f":"'INPUT_Fiche de controle'!D5","v":70},{"$f":"120/C13","v":1.1428571428571428},{"$f":"(E13*'INPUT_Fiche de controle'!D5)/120","v":0.66666666666666663}]
[{"$f":"'INPUT_Fiche de controle'!C6","v":"Groupes minoritaires et indigènes"},-45,{"$f":"COUNTA('INPUT_Fiche de controle'!A39:A44)*7.5","v":45},{"$f":"'INPUT_Fiche de controle'!D6","v":30},2.6666666666666665,{"$f":"(E14*'INPUT_Fiche de controle'!D6)/120","v":0.66666666666666663}]
[{"$f":"'INPUT_Fiche de controle'!C7","v":"Revenu et commodités"},-52.5,{"$f":"COUNTA('INPUT_Fiche de controle'!A46:A52)*7.5","v":52.5},{"$f":"'INPUT_Fiche de controle'!D7","v":35},2.2857142857142856,{"$f":"(E15*'INPUT_Fiche de controle'!D7)/120","v":0.66666666666666663}]
[{"$f":"'INPUT_Fiche de controle'!C8","v":"Effets régionaux dans le pays"},-67.5,{"$f":"COUNTA('INPUT_Fiche de controle'!A54:A62)*7.5","v":67.5},{"$f":"'INPUT_Fiche de controle'!D8","v":45},1.7777777777777777,{"$f":"(E16*'INPUT_Fiche de controle'!D8)/120","v":0.66666666666666663}]
[{"$f":"'INPUT_Fiche de controle'!C9","v":"Participation de l'utilisateur"},-37.5,{"$f":"COUNTA('INPUT_Fiche de controle'!A64:A68)*7.5","v":37.5},{"$f":"'INPUT_Fiche de controle'!D9","v":25},3.2,{"$f":"(E17*'INPUT_Fiche de controle'!D9)/120","v":0.66666666666666663}]
[{"$f":"'INPUT_Fiche de controle'!C10","v":"Ressources naturelles et environnement"},-172.5,{"$f":"COUNTA('INPUT_Fiche de controle'!A70:A92)*7.5","v":172.5},{"$f":"'INPUT_Fiche de controle'!D10","v":115},{"$f":"120/C18","v":0.69565217391304346},{"$f":"(E18*'INPUT_Fiche de controle'!D10)/120","v":0.66666666666666663}]
[]
[]
[]
["Gender and Socioeconomic Spread of Project Beneficiaries"]
[]
[{"$f":"INPUT_Donnée!B9","v":"Homme"},{"$f":"INPUT_Donnée!D9","v":"-"}]
[{"$f":"INPUT_Donnée!B10","v":"Femme"},{"$f":"INPUT_Donnée!D10","v":"-"}]
[{"$f":"INPUT_Donnée!B12","v":"Groupe type 1"},{"$f":"INPUT_Donnée!D12","v":"-"}]
[{"$f":"INPUT_Donnée!B13","v":"Groupe type 2"},{"$f":"INPUT_Donnée!D13","v":"-"}]
[{"$f":"INPUT_Donnée!B14","v":"Groupe type 3"},{"$f":"INPUT_Donnée!D14","v":"-"}]
[{"$f":"INPUT_Donnée!B15","v":"Groupe type 4"},{"$f":"INPUT_Donnée!D15","v":"-"}]
[{"$f":"INPUT_Donnée!B41","v":"Propriétaires"},{"$f":"INPUT_Donnée!D41","v":"-"}]
{"$rows_left_out":4}
{"sheet":"VERSION CONTROL","index":4,"n_rows":22,"n_cols":5,"rows_kept":22,"cut":false,"hidden":true,"merged":[[27,3,27,7],[21,3,21,7],[22,3,22,7],[23,3,23,7],[24,3,24,7],[25,3,25,7],[26,3,26,7],[8,4,8,7],[8,2,8,3],[20,3,20,7],[9,3,11,7],[13,2,13,3],[13,4,13,6],[14,2,14,3],[14,4,14,6],[15,2,15,3],[15,4,15,6],[17,3,17,7],[18,3,18,7],[19,3,19,7]]}
{"$rows_empty":9}
[null,null,null,"Tranlsation of ICID Checklist for Socioeconomic perspectives for SPIS projects"]
[]
[]
[]
[null,null,"Created By",null,"Alqayam Meghji"]
[null,null,"Checked By",null,"Lucie Pluschke"]
[null,null,"Reviewed By"]
[]
[null,"Date","Rev:","Comments"]
[null,"19/03/18",0.1,"Draft for review"]
[null,"23/03/18",0.2,"Inclusion of equity and efficieny"]
[null,"28/03/18",0.3,"Inclusion of environmental considerations and conditional formatting"]
[null,"29/03/18",0.4,"Changes made after review with Lucie Plushke"]

{"sheet":"Reference","index":5,"n_rows":29,"n_cols":3,"rows_kept":29,"cut":false,"hidden":true,"merged":[]}
["Impact","Score YES","Score NO"]
["Positive impact is very likely",5,1]
["Positive impact possible",2,1]
["No impact likely",1,1]
["Negative impact possible",-2,4]
["Negative impact very likely",-5,5]
[]
["Weighting","Linear Multiplier"]
["High",1.5]
["Medium",1]
["Low",0.5]
[]
["Weighting","Linear Multiplier"]
["Yes",1]
["No",-1]
[]
["Questions"]
["https://ec.europa.eu/agriculture/publi/reports/sustain/index_en.pdf  "]
[]
[]
[]
[]
[]
[]
["Agroecology","http://www.fao.org/agroecology/knowledge/10-elements/en/"]
[]
["Questions not included:"]
["Optimum utilisation of the factors of production, in particular labour, increase of agricultural productivity"]
["Assurance of the availability of supplies"]

{"sheet":"Feuille de traduction","index":6,"n_rows":16,"n_cols":3,"rows_kept":16,"cut":false,"hidden":false,"merged":[[1,0,1,2],[4,0,4,4]]}
[]
["Feuille de Traduction"]
[]
["Introduction"]
["Certains textes utilisés dans cet outil sont utilisés dans les formules qui utilisent la reconnaissance de texte. Afin de préserver l'intégrité et la fonctionnalité de la formule, ce texte restera en anglais. Une liste de ces textes et de leur traduction est compilée ci-dessous:"]
["Texte en Anglais","Feuille","Texte en Francais"]
["High","Fiche de controle","Élevée"]
["Low","Fiche de controle","Faible"]
["Medium","Fiche de controle","Moyen"]
["Negative impact possible","Fiche de controle","Impact négatif possible"]
["Negative impact very likely","Fiche de controle","Impact négatif très probable"]
["No","Fiche de controle","Non"]
["No impact likely","Fiche de controle","Aucun impact probable"]
["Positive impact is very likely","Fiche de controle","L'impact positif est très probable"]
["Positive impact possible","Fiche de controle","Impact positif possible"]
["Yes","Fiche de controle","Oui"]