{"text_format":"2","workbook":"xlsx","n_sheets":6,"sheets":["READ ME","INPUT-Checklist","INPUT-Data","OUTPUT Graphs","VERSION CONTROL","Reference"],"not_rendered":{"charts":4,"images":8,"macros":0,"external_links":0,"defined_names":2,"comments":1,"pivot_tables":0},"unopened":[],"bounds":{"document_bytes":16777216,"sheet_cells":100000,"run_cost":"one","rows_first":2000,"rows_last":500,"rows_between":2000,"halvings":0,"cell_chars":16384,"cell_head_chars":4096},"cells_cut":0,"cells_raw":0,"read":"whole","date_system":"1900"}

{"sheet":"READ ME","index":0,"n_rows":82,"n_cols":7,"rows_kept":82,"cut":false,"hidden":false,"merged":[[81,3,81,5],[51,3,51,4],[51,5,51,7],[52,3,52,4],[52,5,52,8],[53,3,55,4],[53,5,54,8],[55,5,55,7],[56,3,56,4],[56,5,56,7],[58,3,65,8],[66,3,74,8],[75,3,79,8],[49,3,50,4],[49,5,50,8],[34,3,36,5],[34,6,36,8],[37,3,39,5],[37,6,39,8],[40,3,41,5],[40,6,41,8],[44,3,45,5],[44,6,45,8],[42,3,43,5],[42,6,43,8],[47,3,47,8],[48,3,48,4],[48,5,48,6],[10,3,10,8],[15,3,15,8],[17,3,17,8],[23,3,23,8],[31,3,31,8],[18,3,21,8]]}
{"$rows_empty":10}
[null,null,null,"Read Me Sheet"]
[]
[]
[]
[]
[null,null,null,"PROMOTE and INITIATE – Impact Assessment Tool"]
[]
[null,null,null,"Introduction"]
[null,null,null,"This tool provides a guide to the possible impacts of solar-powered irrigation systems on socio-economics and environment. Impacts may be regarded as positive, neutral or negative.  The impacts are grouped under the following topic areas:\n1. Population Change and Migration\n2. Women's Role\n3. Minority and Indigene Groups\n4. Income and Amenity \n5. Regional Effects in Country\n6. User Involvement\n7. natural Resources and Environment\nBy using the checklist, SPIS advisors can become more involved in assessing socio-economic and environmental change and in planning the mitigation of adverse impacts. The checklist should enable specialist expertise to be used more effectively and will promote closer co-operation between specialists and non-specialists in the development of socially, economically and environmentally sustainable projects. \n\nThe checklist can already be used in the design of a SPIS system as well as after the SPIS has been installed and used (e.g. 6 months, 2 years and 5 years) for continuous monitoring. The tool is particularly relevant for the Module PROMOTE and INITIATE of the SPIS Toolbox."]
[]
[]
[]
[]
[null,null,null,"Tips & Tricks"]
{"$rows_empty":7}
[null,null,null,"Overview"]
[null,null,null,"This tool comprises the following sheets:"]
[]
[null,null,null,"INPUT-Checklist",null,null,"This sheet comprises of questions that prompt the designer of the SPIS to assess and weigh the socio-economic and environmental aspects of the project. The answers generate graphs for the OUTPUT Graphs sheet. "]
[]
[]
[null,null,null,"INPUT-Data",null,null,"This allows for the entry of data that gives an overview of beneficiaries of the project. The values generate graphs for the OUTPUT Graphs sheet."]
[]
[]
[null,null,null,"OUTPUT Graphs",null,null,"This sheet contains graphs, generated by the INPUT sheets that can be used for assesment and in wider reports to demonstrate the socioeconomic and environmental impacts of the project"]
[]
[null,null,null,"Version Control",null,null,"Hidden. This sheet details the versions and changes made to each revision of this tool"]
[]
[null,null,null,"Reference",null,null,"Hidden. Reference scores and references for questions  contained in this INPUT sheets"]
{"$rows_left_out":25}
{"sheet":"INPUT-Checklist","index":1,"n_rows":92,"n_cols":8,"rows_kept":92,"cut":false,"hidden":false,"merged":[[49,1,49,2],[50,1,50,2],[51,1,51,2],[22,5,22,6],[27,1,27,2],[28,1,28,2],[37,1,37,6],[52,1,52,6],[44,1,44,6],[32,1,32,2],[33,1,33,2],[34,1,34,2],[35,1,35,2],[36,1,36,2],[38,1,38,2],[39,1,39,2],[45,1,45,2],[46,1,46,2],[48,1,48,2],[30,1,30,2],[22,2,22,4],[19,1,19,2],[20,1,20,2],[25,1,25,2],[26,1,26,2],[23,1,23,2],[18,1,18,2],[21,1,21,2],[24,1,24,2],[29,1,29,2],[2,0,2,6],[7,4,7,5],[1,0,1,6],[0,1,0,6],[47,1,47,2],[16,1,16,2],[8,4,8,5],[9,4,9,5],[5,4,5,5],[6,4,6,5],[3,4,3,5],[4,4,4,5],[31,1,31,2],[14,1,14,6],[15,1,15,2],[17,1,17,2],[53,1,53,2],[54,1,54,2],[55,1,55,2],[56,1,56,2],[57,1,57,2],[81,1,81,2],[82,1,82,2],[85,1,85,2],[83,1,83,2],[59,1,59,2],[60,1,60,2],[61,1,61,2],[63,1,63,2],[62,1,62,6],[76,1,76,2],[77,1,77,2],[78,1,78,2],[79,1,79,2],[80,1,80,2],[71,1,71,2],[72,1,72,2],[73,1,73,2],[74,1,74,2],[75,1,75,2],[91,1,91,2],[40,1,40,2],[42,1,42,2],[41,1,41,2],[86,1,86,2],[87,1,87,2],[88,1,88,2],[89,1,89,2],[64,1,64,2],[65,1,65,2],[66,1,66,2],[67,1,67,2],[69,1,69,2],[68,1,68,6],[58,1,58,2],[70,1,70,2]]}
[null,"PROMOTE and INITIATE - Impact Assessment Tool"]
["SOCIO-ECONOMIC AND ENVIRONMENTAL IMPACTS"]
["This checklist is to roughly assess the socio-economic and environmental impacts of solar-powered irrigation systems. "]
[null,1,{"$f":"B15","v":"Population Change and Migration"},{"$f":"SUM(H16:H22)","v":52.5},"Project Name:",null,"sample"]
[null,2,{"$f":"B23","v":"Women's Role"},{"$f":"SUM(H24:H37)","v":105},"Project Location:"]
[null,3,{"$f":"B38","v":"Minority and Indigene Groups"},{"$f":"SUM(H39:H44)","v":45},"User Name:"]
[null,4,{"$f":"B45","v":"Income and Amenities"},{"$f":"SUM(H46:H52)","v":52.5},"Date of Impact Assessment:"]
[null,5,{"$f":"B53","v":"Regional Effects in Country"},{"$f":"SUM(H54:H62)","v":67.5},"Project Duration (years):"]
[null,6,{"$f":"B63","v":"User Involvement"},{"$f":"SUM(H64:H68)","v":37.5},"Asset Lifespan (years):"]
[null,7,{"$f":"B69","v":"Natural Resources and Environment"},{"$f":"SUM(H70:H92)","v":172.5},"Notes:"]
[null,null,"SCORE",{"$f":"SUM(D4+D7+D5+D6+D10+D8+D9)","v":532.5}]
[]
[]
["Ref #","Question",null,"Yes, No or N/A ","Weighting \n(how important is this to the project?)","What is the impact of the project?","Comments"]
[1,"Population Change and Migration"]
["1a","Have changes to population size/density and demographic/ethnic composition been considered in the planning of the Project? ",null,"Yes","High","Positive impact is very likely",null,{"$f":"IFERROR(IF(D16=\"Yes\",(VLOOKUP(E16,Reference!$A$9:$B$11,2,FALSE)*VLOOKUP(F16,Reference!$A$2:$B$7,2,FALSE)*VLOOKUP(D16,Reference!$A$14:$B$15,2,FALSE)),(VLOOKUP(E16,Reference!$A$9:$B$11,2,FALSE)*VLOOKUP(F16,Reference!$A$2:$C$7,3,FALSE)*VLOOKUP(D16,Reference!$A$14:$B$15,2,FALSE))),\" \")","v":7.5}]
["1b","Is the project causing significant demographic changes in the project area or vicinity which may affect social harmony? ",null,"Yes","High","Positive impact is very likely",null,{"$f":"IFERROR(IF(D17=\"Yes\",(VLOOKUP(E17,Reference!$A$9:$B$11,2,FALSE)*VLOOKUP(F17,Reference!$A$2:$B$7,2,FALSE)*VLOOKUP(D17,Reference!$A$14:$B$15,2,FALSE)),(VLOOKUP(E17,Reference!$A$9:$B$11,2,FALSE)*VLOOKUP(F17,Reference!$A$2:$C$7,3,FALSE)*VLOOKUP(D17,Reference!$A$14:$B$15,2,FALSE))),\" \")","v":7.5}]
["1c","Is the project avoiding the physical and economic displacement of people?",null,"Yes","High","Positive impact is very likely",null,{"$f":"IFERROR(IF(D18=\"Yes\",(VLOOKUP(E18,Reference!$A$9:$B$11,2,FALSE)*VLOOKUP(F18,Reference!$A$2:$B$7,2,FALSE)*VLOOKUP(D18,Reference!$A$14:$B$15,2,FALSE)),(VLOOKUP(E18,Reference!$A$9:$B$11,2,FALSE)*VLOOKUP(F18,Reference!$A$2:$C$7,3,FALSE)*VLOOKUP(D18,Reference!$A$14:$B$15,2,FALSE))),\" \")","v":7.5}]
["1d","Has human migration, away form the Project location (e.g. rural flight) and toward it (e.g. demand for (seasonal) agricultural labour), been considered?",null,"Yes","High","Positive impact is very likely",null,{"$f":"IFERROR(IF(D19=\"Yes\",(VLOOKUP(E19,Reference!$A$9:$B$11,2,FALSE)*VLOOKUP(F19,Reference!$A$2:$B$7,2,FALSE)*VLOOKUP(D19,Reference!$A$14:$B$15,2,FALSE)),(VLOOKUP(E19,Reference!$A$9:$B$11,2,FALSE)*VLOOKUP(F19,Reference!$A$2:$C$7,3,FALSE)*VLOOKUP(D19,Reference!$A$14:$B$15,2,FALSE))),\" \")","v":7.5}]
["1e","Does the project ensure decent rural employment, promoting more and better employment opportunities and working conditions and avoiding practices that could increase workers’ vulnerability?",null,"Yes","High","Positive impact is very likely",null,{"$f":"IFERROR(IF(D20=\"Yes\",(VLOOKUP(E20,Reference!$A$9:$B$11,2,FALSE)*VLOOKUP(F20,Reference!$A$2:$B$7,2,FALSE)*VLOOKUP(D20,Reference!$A$14:$B$15,2,FALSE)),(VLOOKUP(E20,Reference!$A$9:$B$11,2,FALSE)*VLOOKUP(F20,Reference!$A$2:$C$7,3,FALSE)*VLOOKUP(D20,Reference!$A$14:$B$15,2,FALSE))),\" \")","v":7.5}]
["1f","Does the project respect the fundamental principles and rights at work and prohibit child labour?",null,"Yes","High","Positive impact is very likely",null,{"$f":"IFERROR(IF(D21=\"Yes\",(VLOOKUP(E21,Reference!$A$9:$B$11,2,FALSE)*VLOOKUP(F21,Reference!$A$2:$B$7,2,FALSE)*VLOOKUP(D21,Reference!$A$14:$B$15,2,FALSE)),(VLOOKUP(E21,Reference!$A$9:$B$11,2,FALSE)*VLOOKUP(F21,Reference!$A$2:$C$7,3,FALSE)*VLOOKUP(D21,Reference!$A$14:$B$15,2,FALSE))),\" \")","v":7.5}]
["1g","Has adequate provision been made for any temporary or migratory population influx to avoid social deprivation, hardship, or conflicts between the permanenet and temporary groups?",null,"Yes","High","Positive impact is very likely",null,{"$f":"IFERROR(IF(D22=\"Yes\",(VLOOKUP(E22,Reference!$A$9:$B$11,2,FALSE)*VLOOKUP(F22,Reference!$A$2:$B$7,2,FALSE)*VLOOKUP(D22,Reference!$A$14:$B$15,2,FALSE)),(VLOOKUP(E22,Reference!$A$9:$B$11,2,FALSE)*VLOOKUP(F22,Reference!$A$2:$C$7,3,FALSE)*VLOOKUP(D22,Reference!$A$14:$B$15,2,FALSE))),\" \")","v":7.5}]
[2,"Women's Role","for more indepth questions and aspects to consider please see:",null,null,"http://www.fao.org/docrep/017/i3173e/i3173e.pdf"]
["2a","Have the needs, priorities and constraints of both women and men been taken into consideration during the design of the project?",null,"Yes","High","Positive impact is very likely",null,{"$f":"IFERROR(IF(D24=\"Yes\",(VLOOKUP(E24,Reference!$A$9:$B$11,2,FALSE)*VLOOKUP(F24,Reference!$A$2:$B$7,2,FALSE)*VLOOKUP(D24,Reference!$A$14:$B$15,2,FALSE)),(VLOOKUP(E24,Reference!$A$9:$B$11,2,FALSE)*VLOOKUP(F24,Reference!$A$2:$C$7,3,FALSE)*VLOOKUP(D24,Reference!$A$14:$B$15,2,FALSE))),\" \")","v":7.5}]
["2b","Does the project change the status and role of women positively in relation to social standing?",null,"Yes","High","Positive impact is very likely",null,{"$f":"IFERROR(IF(D25=\"Yes\",(VLOOKUP(E25,Reference!$A$9:$B$11,2,FALSE)*VLOOKUP(F25,Reference!$A$2:$B$7,2,FALSE)*VLOOKUP(D25,Reference!$A$14:$B$15,2,FALSE)),(VLOOKUP(E25,Reference!$A$9:$B$11,2,FALSE)*VLOOKUP(F25,Reference!$A$2:$C$7,3,FALSE)*VLOOKUP(D25,Reference!$A$14:$B$15,2,FALSE))),\" \")","v":7.5}]
["2c","Does the project change the status and role of women positively in relation to work load?",null,"Yes","High","Positive impact is very likely",null,{"$f":"IFERROR(IF(D26=\"Yes\",(VLOOKUP(E26,Reference!$A$9:$B$11,2,FALSE)*VLOOKUP(F26,Reference!$A$2:$B$7,2,FALSE)*VLOOKUP(D26,Reference!$A$14:$B$15,2,FALSE)),(VLOOKUP(E26,Reference!$A$9:$B$11,2,FALSE)*VLOOKUP(F26,Reference!$A$2:$C$7,3,FALSE)*VLOOKUP(D26,Reference!$A$14:$B$15,2,FALSE))),\" \")","v":7.5}]
["2d","Does the project change the status and role of women positively in relation to access to markets, income, and finance?",null,"Yes","High","Positive impact is very likely",null,{"$f":"IFERROR(IF(D27=\"Yes\",(VLOOKUP(E27,Reference!$A$9:$B$11,2,FALSE)*VLOOKUP(F27,Reference!$A$2:$B$7,2,FALSE)*VLOOKUP(D27,Reference!$A$14:$B$15,2,FALSE)),(VLOOKUP(E27,Reference!$A$9:$B$11,2,FALSE)*VLOOKUP(F27,Reference!$A$2:$C$7,3,FALSE)*VLOOKUP(D27,Reference!$A$14:$B$15,2,FALSE))),\" \")","v":7.5}]
["2e","Does the project change the status and role of women positively in relation to heritage and inheritance?",null,"Yes","High","Positive impact is very likely",null,{"$f":"IFERROR(IF(D28=\"Yes\",(VLOOKUP(E28,Reference!$A$9:$B$11,2,FALSE)*VLOOKUP(F28,Reference!$A$2:$B$7,2,FALSE)*VLOOKUP(D28,Reference!$A$14:$B$15,2,FALSE)),(VLOOKUP(E28,Reference!$A$9:$B$11,2,FALSE)*VLOOKUP(F28,Reference!$A$2:$C$7,3,FALSE)*VLOOKUP(D28,Reference!$A$14:$B$15,2,FALSE))),\" \")","v":7.5}]
["2f","Does the project change the status and role of women positivelyin relation to marital rights?",null,"Yes","High","Positive impact is very likely",null,{"$f":"IFERROR(IF(D29=\"Yes\",(VLOOKUP(E29,Reference!$A$9:$B$11,2,FALSE)*VLOOKUP(F29,Reference!$A$2:$B$7,2,FALSE)*VLOOKUP(D29,Reference!$A$14:$B$15,2,FALSE)),(VLOOKUP(E29,Reference!$A$9:$B$11,2,FALSE)*VLOOKUP(F29,Reference!$A$2:$C$7,3,FALSE)*VLOOKUP(D29,Reference!$A$14:$B$15,2,FALSE))),\" \")","v":7.5}]
["2g","Does the project promote women’s and men’s equitable access to and control over productive resources and services?",null,"Yes","High","Positive impact is very likely",null,{"$f":"IFERROR(IF(D30=\"Yes\",(VLOOKUP(E30,Reference!$A$9:$B$11,2,FALSE)*VLOOKUP(F30,Reference!$A$2:$B$7,2,FALSE)*VLOOKUP(D30,Reference!$A$14:$B$15,2,FALSE)),(VLOOKUP(E30,Reference!$A$9:$B$11,2,FALSE)*VLOOKUP(F30,Reference!$A$2:$C$7,3,FALSE)*VLOOKUP(D30,Reference!$A$14:$B$15,2,FALSE))),\" \")","v":7.5}]
{"$rows_left_out":63}
{"sheet":"INPUT-Data","index":2,"n_rows":45,"n_cols":6,"rows_kept":45,"cut":false,"hidden":false,"merged":[[39,1,39,5],[0,0,0,5],[1,0,1,5],[7,1,7,5],[19,1,19,5],[25,1,25,5]]}
["PROMOTE and INITIATE - Impact Assessment Tool"]
["SOCIO-ECONOMIC DATA"]
["Ref #","Question","ABSOLUTE NUMBER","PERCENTAGE [%]","USER COMMENTS","PROJECT REVIEWER COMMENTS"]
["A1.0","What is the population in the vicinity of the project?\n"]
["A1.1","How many will be impacted by the project?\n",null,{"$f":"IFERROR(C5/C4,\"-\")","v":"-"}]
["A1.2","How many farmers will be impacted by the project?\n",null,{"$f":"IFERROR(C6/C5,\"-\")","v":"-"}]
[null,"TOTAL",{"$f":"SUM(C5:C6)","v":0},{"$f":"C7/C4","v":{"$error":"#DIV/0!"}}]
["A2.0","What is the breakdown of farmers benefitting from the project by gender, by socioeconomic deliniation, and by income?"]
["A2.1","Male",null,{"$f":"IFERROR(C9/(C9+C10),\"-\")","v":"-"}]
["A2.2","Female",null,{"$f":"IFERROR(C10/(C9+C10),\"-\")","v":"-"}]
[null,"TOTAL",{"$f":"SUM(C9:C10)","v":0},{"$f":"C11/C6","v":{"$error":"#DIV/0!"}}]
["A2.3","Group type 1",null,{"$f":"IFERROR(C12/($C$12+$C$13+$C$14+$C$15),\"-\")","v":"-"}]
["A2.4","Group type 2",null,{"$f":"IFERROR(C13/($C$12+$C$13+$C$14+$C$15),\"-\")","v":"-"}]
["A2.5","Group type 3",null,{"$f":"IFERROR(C14/($C$12+$C$13+$C$14+$C$15),\"-\")","v":"-"}]
["A2.6","Group type 4",null,{"$f":"IFERROR(C15/($C$12+$C$13+$C$14+$C$15),\"-\")","v":"-"}]
[null,"TOTAL",{"$f":"SUM(C12:C15)","v":0},{"$f":"C16/C6","v":{"$error":"#DIV/0!"}}]
["A2.7","Unemployed",null,{"$f":"IFERROR(C17/(C9+C10),\"-\")","v":"-"}]
["A2.8","Below poverty line",null,{"$f":"IFERROR(C18/(C9+C10),\"-\")","v":"-"}]
[null,"TOTAL",{"$f":"SUM(C17:C18)","v":0},{"$f":"C19/C11","v":{"$error":"#DIV/0!"}}]
["A3.0","Where are farmers benefitting recruited from?"]
["A3.1","Local in the village",null,{"$f":"IFERROR(C21/($C$21+$C$22+$C$23+$C$24),\"-\")","v":"-"}]
["A3.2","Local resettled",null,{"$f":"IFERROR(C22/($C$21+$C$22+$C$23+$C$24),\"-\")","v":"-"}]
["A3.3","Same sociological background from elsewhere",null,{"$f":"IFERROR(C23/($C$21+$C$22+$C$23+$C$24),\"-\")","v":"-"}]
["A3.4","Different sociological background",null,{"$f":"IFERROR(C24/($C$21+$C$22+$C$23+$C$24),\"-\")","v":"-"}]
[null,"TOTAL",{"$f":"SUM(C21:C24)","v":0},{"$f":"C25/C6","v":{"$error":"#DIV/0!"}}]
["A4.0","What are the labour requirements of the project?"]
["A4.1","Family labour",null,{"$f":"IFERROR(C27/($C$27+$C$28+$C$29+$C$30),\"-\")","v":"-"}]
["A4.2","Local labour",null,{"$f":"IFERROR(C28/($C$27+$C$28+$C$29+$C$30),\"-\")","v":"-"}]
["A4.3","Seasonal local labour",null,{"$f":"IFERROR(C29/($C$27+$C$28+$C$29+$C$30),\"-\")","v":"-"}]
["A4.4","Seasonal labour from afar",null,{"$f":"IFERROR(C30/($C$27+$C$28+$C$29+$C$30),\"-\")","v":"-"}]
{"$rows_left_out":16}
{"sheet":"OUTPUT Graphs","index":3,"n_rows":33,"n_cols":13,"rows_kept":33,"cut":false,"hidden":false,"merged":[[0,1,0,12],[4,12,4,16],[5,12,5,16],[3,1,3,5],[4,1,4,5],[5,1,5,5],[3,12,3,16]]}
[null,"PROMOTE and INITIATE - Impact Assessment Tool"]
[]
[]
["Project Name:",{"$f":"'INPUT-Checklist'!G4","v":"sample"},{"$nulls":5},"Date of Impact Assessment:",{"$nulls":4},{"$f":"'INPUT-Checklist'!G7","v":0}]
["Project Location:",{"$f":"'INPUT-Checklist'!G5","v":0},{"$nulls":5},"Project Duration (years):",{"$nulls":4},{"$f":"'INPUT-Checklist'!G8","v":0}]
["User Name:",{"$f":"'INPUT-Checklist'!G6","v":0},{"$nulls":5},"Asset Lifespan (years):",{"$nulls":4},{"$f":"'INPUT-Checklist'!G9","v":0}]
[]
[]
[]
[]
[null,"Lowest score possible","Highest possible score","Actual Score","correction factor","% Reached"]
[{"$f":"'INPUT-Checklist'!C4","v":"Population Change and Migration"},{"$f":"0-C12","v":-52.5},{"$f":"COUNTA('INPUT-Checklist'!A16:A22)*7.5","v":52.5},{"$f":"'INPUT-Checklist'!D4","v":52.5},{"$f":"120/C12","v":2.2857142857142856},{"$f":"(E12*'INPUT-Checklist'!D4)/120","v":1}]
[{"$f":"'INPUT-Checklist'!C5","v":"Women's Role"},{"$f":"0-C13","v":-105},{"$f":"COUNTA('INPUT-Checklist'!A24:A37)*7.5","v":105},{"$f":"'INPUT-Checklist'!D5","v":105},{"$f":"120/C13","v":1.1428571428571428},{"$f":"(E13*'INPUT-Checklist'!D5)/120","v":1}]
[{"$f":"'INPUT-Checklist'!C6","v":"Minority and Indigene Groups"},-45,{"$f":"COUNTA('INPUT-Checklist'!A39:A44)*7.5","v":45},{"$f":"'INPUT-Checklist'!D6","v":45},2.6666666666666665,{"$f":"(E14*'INPUT-Checklist'!D6)/120","v":1}]
[{"$f":"'INPUT-Checklist'!C7","v":"Income and Amenities"},-52.5,{"$f":"COUNTA('INPUT-Checklist'!A46:A52)*7.5","v":52.5},{"$f":"'INPUT-Checklist'!D7","v":52.5},2.2857142857142856,{"$f":"(E15*'INPUT-Checklist'!D7)/120","v":1}]
[{"$f":"'INPUT-Checklist'!C8","v":"Regional Effects in Country"},-67.5,{"$f":"COUNTA('INPUT-Checklist'!A54:A62)*7.5","v":67.5},{"$f":"'INPUT-Checklist'!D8","v":67.5},1.7777777777777777,{"$f":"(E16*'INPUT-Checklist'!D8)/120","v":1}]
[{"$f":"'INPUT-Checklist'!C9","v":"User Involvement"},-37.5,{"$f":"COUNTA('INPUT-Checklist'!A64:A68)*7.5","v":37.5},{"$f":"'INPUT-Checklist'!D9","v":37.5},3.2,{"$f":"(E17*'INPUT-Checklist'!D9)/120","v":1}]
[{"$f":"'INPUT-Checklist'!C10","v":"Natural Resources and Environment"},-172.5,{"$f":"COUNTA('INPUT-Checklist'!A70:A92)*7.5","v":172.5},{"$f":"'INPUT-Checklist'!D10","v":172.5},{"$f":"120/C18","v":0.69565217391304346},{"$f":"(E18*'INPUT-Checklist'!D10)/120","v":1}]
[]
[]
[]
["Gender and Socioeconomic Spread of Project Beneficiaries"]
[]
[{"$f":"'INPUT-Data'!B9","v":"Male"},{"$f":"'INPUT-Data'!D9","v":"-"}]
[{"$f":"'INPUT-Data'!B10","v":"Female"},{"$f":"'INPUT-Data'!D10","v":"-"}]
[{"$f":"'INPUT-Data'!B12","v":"Group type 1"},{"$f":"'INPUT-Data'!D12","v":"-"}]
[{"$f":"'INPUT-Data'!B13","v":"Group type 2"},{"$f":"'INPUT-Data'!D13","v":"-"}]
[{"$f":"'INPUT-Data'!B14","v":"Group type 3"},{"$f":"'INPUT-Data'!D14","v":"-"}]
[{"$f":"'INPUT-Data'!B15","v":"Group type 4"},{"$f":"'INPUT-Data'!D15","v":"-"}]
[{"$f":"'INPUT-Data'!B41","v":"Landowner"},{"$f":"'INPUT-Data'!D41","v":"-"}]
{"$rows_left_out":4}
{"sheet":"VERSION CONTROL","index":4,"n_rows":22,"n_cols":5,"rows_kept":22,"cut":false,"hidden":true,"merged":[[27,3,27,7],[21,3,21,7],[22,3,22,7],[23,3,23,7],[24,3,24,7],[25,3,25,7],[26,3,26,7],[8,4,8,7],[8,2,8,3],[20,3,20,7],[9,3,11,7],[13,2,13,3],[13,4,13,6],[14,2,14,3],[14,4,14,6],[15,2,15,3],[15,4,15,6],[17,3,17,7],[18,3,18,7],[19,3,19,7]]}
{"$rows_empty":9}
[null,null,null,"Tranlsation of ICID Checklist for Socioeconomic perspectives for SPIS projects"]
[]
[]
[]
[null,null,"Created By",null,"Alqayam Meghji"]
[null,null,"Checked By",null,"Lucie Pluschke"]
[null,null,"Reviewed By"]
[]
[null,"Date","Rev:","Comments"]
[null,"19/03/18",0.1,"Draft for review"]
[null,"23/03/18",0.2,"Inclusion of equity and efficieny"]
[null,"28/03/18",0.3,"Inclusion of environmental considerations and conditional formatting"]
[null,"29/03/18",0.4,"Changes made after review with Lucie Plushke"]

{"sheet":"Reference","index":5,"n_rows":29,"n_cols":3,"rows_kept":29,"cut":false,"hidden":true,"merged":[]}
["Impact","Score YES","Score NO"]
["Positive impact is very likely",5,1]
["Positive impact possible",2,1]
["No impact likely",1,1]
["Negative impact possible",-2,4]
["Negative impact very likely",-5,5]
[]
["Weighting","Linear Multiplier"]
["High",1.5]
["Medium",1]
["Low",0.5]
[]
["Weighting","Linear Multiplier"]
["Yes",1]
["No",-1]
[]
["Questions"]
["https://ec.europa.eu/agriculture/publi/reports/sustain/index_en.pdf  "]
[]
[]
[]
[]
[]
[]
["Agroecology","http://www.fao.org/agroecology/knowledge/10-elements/en/"]
[]
["Questions not included:"]
["Optimum utilisation of the factors of production, in particular labour, increase of agricultural productivity"]
["Assurance of the availability of supplies"]